BDBM50198761 CHEMBL3901608
SMILES: Oc1cccc(NC(=O)\C=C2/SC(=S)NC2=O)c1
InChI Key: InChIKey=AIUQGFAQXAHHII-YVMONPNESA-N
Data: 1 KI  1 IC50
Activity Spreadsheet -- Enzyme Inhibition Constant Data from BindingDB
Found 2 hits for monomerid = 50198761
Trg + Lig
Ki
nM
ΔG°
kcal/mole
IC50
nM
Kd
nM
EC50/IC50
nM
koff
s-1
kon
M-1s-1
pHTemp
°C
CDGSH iron-sulfur domain-containing protein 1
(Homo sapiens (Human))
BDBM50198761
(CHEMBL3901608)
Show SMILES Oc1cccc(NC(=O)\C=C2/SC(=S)NC2=O)c1
Show InChI InChI=1S/C11H8N2O3S2/c14-7-3-1-2-6(4-7)12-9(15)5-8-10(16)13-11(17)18-8/h1-5,14H,(H,12,15)(H,13,16,17)/b8-5-
583n/an/an/an/an/an/an/an/a
West Virginia University
Curated by ChEMBL
Assay Description
Displacement of [3H]rosiglitazone from recombinant human C-terminal His-tagged MitoNEET cytosolic domain (32 to 108 residues) expressed in Escherichi...
Bioorg Med Chem Lett 26: 5350-5353 (2016)
Article DOI: 10.1016/j.bmcl.2016.09.009
BindingDB Entry DOI: 10.7270/Q2ZP483C
CDGSH iron-sulfur domain-containing protein 1
(Homo sapiens (Human))
BDBM50198761
(CHEMBL3901608)
Show SMILES Oc1cccc(NC(=O)\C=C2/SC(=S)NC2=O)c1
Show InChI InChI=1S/C11H8N2O3S2/c14-7-3-1-2-6(4-7)12-9(15)5-8-10(16)13-11(17)18-8/h1-5,14H,(H,12,15)(H,13,16,17)/b8-5-
n/an/a 1.37E+4n/an/an/an/an/an/a
West Virginia University
Curated by ChEMBL
Assay Description
Displacement of [3H]rosiglitazone from recombinant human C-terminal His-tagged MitoNEET cytosolic domain (32 to 108 residues) expressed in Escherichi...
Bioorg Med Chem Lett 26: 5350-5353 (2016)
Article DOI: 10.1016/j.bmcl.2016.09.009
BindingDB Entry DOI: 10.7270/Q2ZP483C