BDBM50198823 7-(3,5-dimethylisoxazol-4-yl)-5-methyl-N-(4-(2-(pyrrolidin-1-yl)ethoxy)phenyl)benzo[e][1,2,4]triazin-3-amine::CHEMBL230898::US8481536, 385
SMILES: Cc1noc(C)c1-c1cc(C)c2nc(Nc3ccc(OCCN4CCCC4)cc3)nnc2c1
InChI Key: InChIKey=PHKQJROKJVBZGO-UHFFFAOYSA-N
Data: 2 IC50
Activity Spreadsheet -- Enzyme Inhibition Constant Data from BindingDB
Found 2 hits for monomerid = 50198823
Trg + Lig
Ki
nM
ΔG°
kcal/mole
IC50
nM
Kd
nM
EC50/IC50
nM
koff
s-1
kon
M-1s-1
pHTemp
°C
Proto-oncogene tyrosine-protein kinase Src
(Homo sapiens (Human))
BDBM50198823
(7-(3,5-dimethylisoxazol-4-yl)-5-methyl-N-(4-(2-(py...)
Show SMILES Cc1noc(C)c1-c1cc(C)c2nc(Nc3ccc(OCCN4CCCC4)cc3)nnc2c1
Show InChI InChI=1S/C25H28N6O2/c1-16-14-19(23-17(2)30-33-18(23)3)15-22-24(16)27-25(29-28-22)26-20-6-8-21(9-7-20)32-13-12-31-10-4-5-11-31/h6-9,14-15H,4-5,10-13H2,1-3H3,(H,26,27,29)
n/an/a 207n/an/an/an/an/an/a
TargeGen, Inc.
Curated by ChEMBL
Assay Description
Inhibition of Src
Bioorg Med Chem Lett 17: 602-8 (2007)
Article DOI: 10.1016/j.bmcl.2006.11.006
BindingDB Entry DOI: 10.7270/Q29024MW
Proto-oncogene tyrosine-protein kinase Src
(Homo sapiens (Human))
BDBM50198823
(7-(3,5-dimethylisoxazol-4-yl)-5-methyl-N-(4-(2-(py...)
Show SMILES Cc1noc(C)c1-c1cc(C)c2nc(Nc3ccc(OCCN4CCCC4)cc3)nnc2c1
Show InChI InChI=1S/C25H28N6O2/c1-16-14-19(23-17(2)30-33-18(23)3)15-22-24(16)27-25(29-28-22)26-20-6-8-21(9-7-20)32-13-12-31-10-4-5-11-31/h6-9,14-15H,4-5,10-13H2,1-3H3,(H,26,27,29)
US Patent
n/an/a 207n/an/an/an/an/a25
TargeGen, Inc.
US Patent
Assay Description
Testing of inhibition of kinases in vitro using luciferase-based assay from KinaseGlo, Promega Corp.
US Patent US8481536 (2013)
BindingDB Entry DOI: 10.7270/Q2GB22PZ