null
SMILES: CC1CCN(CC1)C(=O)C(CCn1cccc1C#N)NS(=O)(=O)c1ccccc1
InChI Key: InChIKey=UWIFNZPQBKJFLK-UHFFFAOYSA-N
Activity Spreadsheet -- Enzyme Inhibition Constant Data from BindingDB
Found 2 hits for monomerid = 50198993
Trg + Lig
Ki
nM
ΔG°
kcal/mole
IC50
nM
Kd
nM
EC50/IC50
nM
koff
s-1
kon
M-1s-1
pHTemp
°C
C-C chemokine receptor type 10
(Mus musculus)
BDBM50198993
(CHEMBL3896799)
Show SMILES CC1CCN(CC1)C(=O)C(CCn1cccc1C#N)NS(=O)(=O)c1ccccc1
Show InChI InChI=1S/C21H26N4O3S/c1-17-9-13-25(14-10-17)21(26)20(11-15-24-12-5-6-18(24)16-22)23-29(27,28)19-7-3-2-4-8-19/h2-8,12,17,20,23H,9-11,13-15H2,1H3
n/an/a<2.00E+4n/an/an/an/an/an/a
Boehringer Ingelheim Pharmaceuticals
Curated by ChEMBL
Assay Description
Antagonist activity at mouse CCR10 expressed in CHOK1 cells coexpressing aequorin/Galphaq assessed as inhibition of CCL27-dependent calcium flux in p...
Bioorg Med Chem Lett 26: 5277-5283 (2016)
Article DOI: 10.1016/j.bmcl.2016.09.047
BindingDB Entry DOI: 10.7270/Q2KD20WF
C-C chemokine receptor type 10
(Homo sapiens (Human))
BDBM50198993
(CHEMBL3896799)
Show SMILES CC1CCN(CC1)C(=O)C(CCn1cccc1C#N)NS(=O)(=O)c1ccccc1
Show InChI InChI=1S/C21H26N4O3S/c1-17-9-13-25(14-10-17)21(26)20(11-15-24-12-5-6-18(24)16-22)23-29(27,28)19-7-3-2-4-8-19/h2-8,12,17,20,23H,9-11,13-15H2,1H3
n/an/a 1.26E+3n/an/an/an/an/an/a
Boehringer Ingelheim Pharmaceuticals
Curated by ChEMBL
Assay Description
Antagonist activity at human CCR10 expressed in CHOK1 cells coexpressing aequorin/Galphaq assessed as inhibition of human CCL27-dependent calcium flu...
Bioorg Med Chem Lett 26: 5277-5283 (2016)
Article DOI: 10.1016/j.bmcl.2016.09.047
BindingDB Entry DOI: 10.7270/Q2KD20WF