null
SMILES: CC1CCCCN1C(=O)C(CCn1cccc1C#N)NS(=O)(=O)c1cc(Cl)c(N)c(Cl)c1
InChI Key: InChIKey=WPYNFVJDHQRBAL-UHFFFAOYSA-N
Activity Spreadsheet -- Enzyme Inhibition Constant Data from BindingDB
Found 1 hit for monomerid = 50199001
Trg + Lig
Ki
nM
ΔG°
kcal/mole
IC50
nM
Kd
nM
EC50/IC50
nM
koff
s-1
kon
M-1s-1
pHTemp
°C
C-C chemokine receptor type 10
(Homo sapiens (Human))
BDBM50199001
(CHEMBL3927890)
Show SMILES CC1CCCCN1C(=O)C(CCn1cccc1C#N)NS(=O)(=O)c1cc(Cl)c(N)c(Cl)c1
Show InChI InChI=1S/C21H25Cl2N5O3S/c1-14-5-2-3-9-28(14)21(29)19(7-10-27-8-4-6-15(27)13-24)26-32(30,31)16-11-17(22)20(25)18(23)12-16/h4,6,8,11-12,14,19,26H,2-3,5,7,9-10,25H2,1H3
n/an/a 794n/an/an/an/an/an/a
Boehringer Ingelheim Pharmaceuticals
Curated by ChEMBL
Assay Description
Antagonist activity at human CCR10 expressed in CHOK1 cells coexpressing aequorin/Galphaq assessed as inhibition of human CCL27-dependent calcium flu...
Bioorg Med Chem Lett 26: 5277-5283 (2016)
Article DOI: 10.1016/j.bmcl.2016.09.047
BindingDB Entry DOI: 10.7270/Q2KD20WF