BDBM50199080 CHEMBL3945769
SMILES: CC1CCN(CC1)C(=O)C(CCn1cccc1C#N)NS(=O)(=O)c1cccc2n(C)ccc12
InChI Key: InChIKey=GJBZOFJQFQXZEW-UHFFFAOYSA-N
Data: 2 IC50
Activity Spreadsheet -- Enzyme Inhibition Constant Data from BindingDB
Found 2 hits for monomerid = 50199080
Trg + Lig
Ki
nM
ΔG°
kcal/mole
IC50
nM
Kd
nM
EC50/IC50
nM
koff
s-1
kon
M-1s-1
pHTemp
°C
C-C chemokine receptor type 10
(Mus musculus)
BDBM50199080
(CHEMBL3945769)
Show SMILES CC1CCN(CC1)C(=O)C(CCn1cccc1C#N)NS(=O)(=O)c1cccc2n(C)ccc12
Show InChI InChI=1S/C24H29N5O3S/c1-18-8-14-29(15-9-18)24(30)21(11-16-28-12-4-5-19(28)17-25)26-33(31,32)23-7-3-6-22-20(23)10-13-27(22)2/h3-7,10,12-13,18,21,26H,8-9,11,14-16H2,1-2H3
n/an/a 6.31E+3n/an/an/an/an/an/a
Boehringer Ingelheim Pharmaceuticals
Curated by ChEMBL
Assay Description
Antagonist activity at mouse CCR10 expressed in CHOK1 cells coexpressing aequorin/Galphaq assessed as inhibition of CCL27-dependent calcium flux in p...
Bioorg Med Chem Lett 26: 5277-5283 (2016)
Article DOI: 10.1016/j.bmcl.2016.09.047
BindingDB Entry DOI: 10.7270/Q2KD20WF
C-C chemokine receptor type 10
(Homo sapiens (Human))
BDBM50199080
(CHEMBL3945769)
Show SMILES CC1CCN(CC1)C(=O)C(CCn1cccc1C#N)NS(=O)(=O)c1cccc2n(C)ccc12
Show InChI InChI=1S/C24H29N5O3S/c1-18-8-14-29(15-9-18)24(30)21(11-16-28-12-4-5-19(28)17-25)26-33(31,32)23-7-3-6-22-20(23)10-13-27(22)2/h3-7,10,12-13,18,21,26H,8-9,11,14-16H2,1-2H3
n/an/a 126n/an/an/an/an/an/a
Boehringer Ingelheim Pharmaceuticals
Curated by ChEMBL
Assay Description
Antagonist activity at human CCR10 expressed in CHOK1 cells coexpressing aequorin/Galphaq assessed as inhibition of human CCL27-dependent calcium flu...
Bioorg Med Chem Lett 26: 5277-5283 (2016)
Article DOI: 10.1016/j.bmcl.2016.09.047
BindingDB Entry DOI: 10.7270/Q2KD20WF