BDBM50199101 CHEMBL3920226
SMILES: CC(=O)c1ccc(OCc2cccc(F)c2)cc1O
InChI Key: InChIKey=UFWGBYKUPYCCBE-UHFFFAOYSA-N
Data: 5 IC50
Activity Spreadsheet -- Enzyme Inhibition Constant Data from BindingDB
Found 5 hits for monomerid = 50199101
Trg + Lig
Ki
nM
ΔG°
kcal/mole
IC50
nM
Kd
nM
EC50/IC50
nM
koff
s-1
kon
M-1s-1
pHTemp
°C
Amine oxidase [flavin-containing] B
(Homo sapiens (Human))
BDBM50199101
(CHEMBL3920226)
Show SMILES CC(=O)c1ccc(OCc2cccc(F)c2)cc1O
Show InChI InChI=1S/C15H13FO3/c1-10(17)14-6-5-13(8-15(14)18)19-9-11-3-2-4-12(16)7-11/h2-8,18H,9H2,1H3
n/an/a 2.80n/an/an/an/an/an/a
China Pharmaceutical University
Curated by ChEMBL
Assay Description
Inhibition of recombinant human MAO-B using kynuramine as substrate assessed as decrease in 4-hydroxyquinoline production incubated for 20 mins by fl...
Bioorg Med Chem 24: 5929-5940 (2016)
Article DOI: 10.1016/j.bmc.2016.09.050
BindingDB Entry DOI: 10.7270/Q2FN1854
Amine oxidase (flavin-containing) A
(Homo sapiens (Human))
BDBM50199101
(CHEMBL3920226)
Show SMILES CC(=O)c1ccc(OCc2cccc(F)c2)cc1O
Show InChI InChI=1S/C15H13FO3/c1-10(17)14-6-5-13(8-15(14)18)19-9-11-3-2-4-12(16)7-11/h2-8,18H,9H2,1H3
n/an/a 5.07E+4n/an/an/an/an/an/a
China Pharmaceutical University
Curated by ChEMBL
Assay Description
Inhibition of recombinant human MAO-A using kynuramine as substrate assessed as decrease in 4-hydroxyquinoline production incubated for 20 mins by fl...
Bioorg Med Chem 24: 5929-5940 (2016)
Article DOI: 10.1016/j.bmc.2016.09.050
BindingDB Entry DOI: 10.7270/Q2FN1854
Amine oxidase [flavin-containing] B
(Homo sapiens (Human))
BDBM50199101
(CHEMBL3920226)
Show SMILES CC(=O)c1ccc(OCc2cccc(F)c2)cc1O
Show InChI InChI=1S/C15H13FO3/c1-10(17)14-6-5-13(8-15(14)18)19-9-11-3-2-4-12(16)7-11/h2-8,18H,9H2,1H3
n/an/a 2.90n/an/an/an/an/an/a
College of Chemistry and Pharmaceutical Engineering, Nanyang Normal University, Nanyang 473061, China. Electronic address: sangzhipei@126.com.
Curated by ChEMBL
Assay Description
Inhibition of recombinant human MAO-B expressed in insect cell microsomes using kynuramine as substrate by fluorescence spectrophotometric method
Bioorg Med Chem Lett 27: 5046-5052 (2017)
Article DOI: 10.1016/j.bmcl.2017.09.057
BindingDB Entry DOI: 10.7270/Q2XS5XTR
Amine oxidase [flavin-containing] B
(Homo sapiens (Human))
BDBM50199101
(CHEMBL3920226)
Show SMILES CC(=O)c1ccc(OCc2cccc(F)c2)cc1O
Show InChI InChI=1S/C15H13FO3/c1-10(17)14-6-5-13(8-15(14)18)19-9-11-3-2-4-12(16)7-11/h2-8,18H,9H2,1H3
n/an/a 41n/an/an/an/an/an/a
China Pharmaceutical University
Curated by ChEMBL
Assay Description
Inhibition of recombinant human MAO-B using p-tyramine as substrate assessed as decrease in H2O2 production incubated for 15 mins by fluorimetric met...
Bioorg Med Chem 24: 5929-5940 (2016)
Article DOI: 10.1016/j.bmc.2016.09.050
BindingDB Entry DOI: 10.7270/Q2FN1854
Amine oxidase (flavin-containing) A
(Homo sapiens (Human))
BDBM50199101
(CHEMBL3920226)
Show SMILES CC(=O)c1ccc(OCc2cccc(F)c2)cc1O
Show InChI InChI=1S/C15H13FO3/c1-10(17)14-6-5-13(8-15(14)18)19-9-11-3-2-4-12(16)7-11/h2-8,18H,9H2,1H3
n/an/a>1.00E+5n/an/an/an/an/an/a
China Pharmaceutical University
Curated by ChEMBL
Assay Description
Inhibition of recombinant human MAO-A using p-tyramine as substrate assessed as decrease in H2O2 production incubated for 15 mins by fluorimetric met...
Bioorg Med Chem 24: 5929-5940 (2016)
Article DOI: 10.1016/j.bmc.2016.09.050
BindingDB Entry DOI: 10.7270/Q2FN1854