BDBM50199529 CHEMBL440054::N,N'-dimethyl-N,N'-bis[2-(1-oxo-8,15-didehydrolycodinocarbonyl)ethyl]-1,12-dodecanediamine
SMILES: CN(CCCCCCCCCCCCN(C)CCC(=O)N1CCC[C@@H]2[C@@H]3Cc4[nH]c(=O)ccc4[C@]12CC(C)=C3)CCC(=O)N1CCC[C@@H]2[C@@H]3Cc4[nH]c(=O)ccc4[C@]12CC(C)=C3
InChI Key: InChIKey=TUYZMCKAYFZSRO-OGOZHRJYSA-N
Data: 2 IC50
Activity Spreadsheet -- Enzyme Inhibition Constant Data from BindingDB
Found 2 hits for monomerid = 50199529
Trg + Lig
Ki
nM
ΔG°
kcal/mole
IC50
nM
Kd
nM
EC50/IC50
nM
koff
s-1
kon
M-1s-1
pHTemp
°C
Acetylcholinesterase
(Rattus norvegicus (rat))
BDBM50199529
(CHEMBL440054 | N,N'-dimethyl-N,N'-bis[2-(1-oxo-8,1...)
Show SMILES CN(CCCCCCCCCCCCN(C)CCC(=O)N1CCC[C@@H]2[C@@H]3Cc4[nH]c(=O)ccc4[C@]12CC(C)=C3)CCC(=O)N1CCC[C@@H]2[C@@H]3Cc4[nH]c(=O)ccc4[C@]12CC(C)=C3 |c:40,67,THB:32:33:24:35.36.38,28:27:24:35.36.38,55:56:47:58.59.61,51:50:47:58.59.61|
Show InChI InChI=1S/C52H76N6O4/c1-37-31-39-33-45-43(19-21-47(59)53-45)51(35-37)41(39)17-15-27-57(51)49(61)23-29-55(3)25-13-11-9-7-5-6-8-10-12-14-26-56(4)30-24-50(62)58-28-16-18-42-40-32-38(2)36-52(42,58)44-20-22-48(60)54-46(44)34-40/h19-22,31-32,39-42H,5-18,23-30,33-36H2,1-4H3,(H,53,59)(H,54,60)/t39-,40-,41+,42+,51+,52+/m0/s1
n/an/a 23.1n/an/an/an/a5.0n/a
Chinese Academy of Sciences
Curated by ChEMBL
Assay Description
Inhibition of AChE in rat cortex at pH 5
Bioorg Med Chem 15: 1394-408 (2007)
Article DOI: 10.1016/j.bmc.2006.11.009
BindingDB Entry DOI: 10.7270/Q27W6BTX
Carboxylic ester hydrolase
(Rattus norvegicus (rat))
BDBM50199529
(CHEMBL440054 | N,N'-dimethyl-N,N'-bis[2-(1-oxo-8,1...)
Show SMILES CN(CCCCCCCCCCCCN(C)CCC(=O)N1CCC[C@@H]2[C@@H]3Cc4[nH]c(=O)ccc4[C@]12CC(C)=C3)CCC(=O)N1CCC[C@@H]2[C@@H]3Cc4[nH]c(=O)ccc4[C@]12CC(C)=C3 |c:40,67,THB:32:33:24:35.36.38,28:27:24:35.36.38,55:56:47:58.59.61,51:50:47:58.59.61|
Show InChI InChI=1S/C52H76N6O4/c1-37-31-39-33-45-43(19-21-47(59)53-45)51(35-37)41(39)17-15-27-57(51)49(61)23-29-55(3)25-13-11-9-7-5-6-8-10-12-14-26-56(4)30-24-50(62)58-28-16-18-42-40-32-38(2)36-52(42,58)44-20-22-48(60)54-46(44)34-40/h19-22,31-32,39-42H,5-18,23-30,33-36H2,1-4H3,(H,53,59)(H,54,60)/t39-,40-,41+,42+,51+,52+/m0/s1
Reactome pathway
n/an/a 8.84E+4n/an/an/an/an/an/a
Chinese Academy of Sciences
Curated by ChEMBL
Assay Description
Inhibition of BuChE in rat serum
Bioorg Med Chem 15: 1394-408 (2007)
Article DOI: 10.1016/j.bmc.2006.11.009
BindingDB Entry DOI: 10.7270/Q27W6BTX