BDBM50199543 CHEMBL245080::N,N'-dimethyl-N,N-bis(1-oxo-8,15-didehydrolycodinocarbonylmethyl)-1,6-hexanediamine
SMILES: CN(CCCCCCN(C)CC(=O)N1CCC[C@@H]2[C@@H]3Cc4[nH]c(=O)ccc4[C@]12CC(C)=C3)CC(=O)N1CCC[C@@H]2[C@@H]3Cc4[nH]c(=O)ccc4[C@]12CC(C)=C3
InChI Key: InChIKey=OSYUHORWAUGEMC-YKAKTTSNSA-N
Data: 2 IC50
Activity Spreadsheet -- Enzyme Inhibition Constant Data from BindingDB
Found 2 hits for monomerid = 50199543
Trg + Lig
Ki
nM
ΔG°
kcal/mole
IC50
nM
Kd
nM
EC50/IC50
nM
koff
s-1
kon
M-1s-1
pHTemp
°C
Carboxylic ester hydrolase
(Rattus norvegicus (rat))
BDBM50199543
(CHEMBL245080 | N,N'-dimethyl-N,N-bis(1-oxo-8,15-di...)
Show SMILES CN(CCCCCCN(C)CC(=O)N1CCC[C@@H]2[C@@H]3Cc4[nH]c(=O)ccc4[C@]12CC(C)=C3)CC(=O)N1CCC[C@@H]2[C@@H]3Cc4[nH]c(=O)ccc4[C@]12CC(C)=C3 |c:33,59,THB:30:29:17:19.20.26,43:42:39:50.53.51,47:48:39:50.53.51|
Show InChI InChI=1S/C44H60N6O4/c1-29-21-31-23-37-35(13-15-39(51)45-37)43(25-29)33(31)11-9-19-49(43)41(53)27-47(3)17-7-5-6-8-18-48(4)28-42(54)50-20-10-12-34-32-22-30(2)26-44(34,50)36-14-16-40(52)46-38(36)24-32/h13-16,21-22,31-34H,5-12,17-20,23-28H2,1-4H3,(H,45,51)(H,46,52)/t31-,32-,33+,34+,43+,44+/m0/s1
Reactome pathway
n/an/a 6.45E+4n/an/an/an/an/an/a
Chinese Academy of Sciences
Curated by ChEMBL
Assay Description
Inhibition of BuChE in rat serum
Bioorg Med Chem 15: 1394-408 (2007)
Article DOI: 10.1016/j.bmc.2006.11.009
BindingDB Entry DOI: 10.7270/Q27W6BTX
Acetylcholinesterase
(Rattus norvegicus (rat))
BDBM50199543
(CHEMBL245080 | N,N'-dimethyl-N,N-bis(1-oxo-8,15-di...)
Show SMILES CN(CCCCCCN(C)CC(=O)N1CCC[C@@H]2[C@@H]3Cc4[nH]c(=O)ccc4[C@]12CC(C)=C3)CC(=O)N1CCC[C@@H]2[C@@H]3Cc4[nH]c(=O)ccc4[C@]12CC(C)=C3 |c:33,59,THB:30:29:17:19.20.26,43:42:39:50.53.51,47:48:39:50.53.51|
Show InChI InChI=1S/C44H60N6O4/c1-29-21-31-23-37-35(13-15-39(51)45-37)43(25-29)33(31)11-9-19-49(43)41(53)27-47(3)17-7-5-6-8-18-48(4)28-42(54)50-20-10-12-34-32-22-30(2)26-44(34,50)36-14-16-40(52)46-38(36)24-32/h13-16,21-22,31-34H,5-12,17-20,23-28H2,1-4H3,(H,45,51)(H,46,52)/t31-,32-,33+,34+,43+,44+/m0/s1
n/an/a 76.2n/an/an/an/a5.0n/a
Chinese Academy of Sciences
Curated by ChEMBL
Assay Description
Inhibition of AChE in rat cortex at pH 5
Bioorg Med Chem 15: 1394-408 (2007)
Article DOI: 10.1016/j.bmc.2006.11.009
BindingDB Entry DOI: 10.7270/Q27W6BTX