null
SMILES: CCn1nc(cc(NC(=O)Nc2c(Cl)cncc2Cl)c1=O)-c1cccc(c1)-c1ccc(O)cc1F
InChI Key: InChIKey=TWQORNPXVHKGQU-UHFFFAOYSA-N
Activity Spreadsheet -- Enzyme Inhibition Constant Data from BindingDB
Found 1 hit for monomerid = 50199710
Trg + Lig
Ki
nM
ΔG°
kcal/mole
IC50
nM
Kd
nM
EC50/IC50
nM
koff
s-1
kon
M-1s-1
pHTemp
°C
cAMP-specific 3',5'-cyclic phosphodiesterase 4B
(Homo sapiens (Human))
BDBM50199710
(CHEMBL3974515)
Show SMILES CCn1nc(cc(NC(=O)Nc2c(Cl)cncc2Cl)c1=O)-c1cccc(c1)-c1ccc(O)cc1F
Show InChI InChI=1S/C24H18Cl2FN5O3/c1-2-32-23(34)21(29-24(35)30-22-17(25)11-28-12-18(22)26)10-20(31-32)14-5-3-4-13(8-14)16-7-6-15(33)9-19(16)27/h3-12,33H,2H2,1H3,(H2,28,29,30,35)
n/an/a 0.0400n/an/an/an/an/an/a
Rhône-Poulenc Rorer
Curated by ChEMBL
Assay Description
Inhibition of human recombinant PDE4B1 assessed as reduction in [3H]cAMP hydrolysis to [3H]AMP incubated for 60 mins by PDE-SPA assay
J Med Chem 59: 10479-10497 (2016)
Article DOI: 10.1021/acs.jmedchem.6b00829
BindingDB Entry DOI: 10.7270/Q21G0P75