BDBM50199908 3-((7R,8R,9alphaR)-7,8-dimethyl-2-(pyridin-4-ylmethyl)-octahydro-1H-pyrido[1,2-R]pyrazin-8-yl)phenol::CHEMBL219152
SMILES: C[C@H]1CN2CCN(Cc3ccncc3)C[C@H]2C[C@@]1(C)c1cccc(O)c1
InChI Key: InChIKey=YZAGFNSTLFFQRX-UCNVEGJOSA-N
Data: 2 KI  1 IC50
Activity Spreadsheet -- Enzyme Inhibition Constant Data from BindingDB
Found 3 hits for monomerid = 50199908
Trg + Lig
Ki
nM
ΔG°
kcal/mole
IC50
nM
Kd
nM
EC50/IC50
nM
koff
s-1
kon
M-1s-1
pHTemp
°C
Mu-type opioid receptor
(Homo sapiens (Human))
BDBM50199908
(3-((7R,8R,9alphaR)-7,8-dimethyl-2-(pyridin-4-ylmet...)
Show SMILES C[C@H]1CN2CCN(Cc3ccncc3)C[C@H]2C[C@@]1(C)c1cccc(O)c1 |r|
Show InChI InChI=1S/C22H29N3O/c1-17-14-25-11-10-24(15-18-6-8-23-9-7-18)16-20(25)13-22(17,2)19-4-3-5-21(26)12-19/h3-9,12,17,20,26H,10-11,13-16H2,1-2H3/t17-,20+,22+/m0/s1
NCI pathway
Reactome pathway
15n/an/an/an/an/an/an/an/a
Adolor Corporation
Curated by ChEMBL
Assay Description
Displacement of [3H]diprenorphine from human cloned mu opioid receptor expressed in CHO cells
J Med Chem 49: 7290-306 (2006)
Article DOI: 10.1021/jm0604878
BindingDB Entry DOI: 10.7270/Q2CF9QW8
Delta-type opioid receptor
(Homo sapiens (Human))
BDBM50199908
(3-((7R,8R,9alphaR)-7,8-dimethyl-2-(pyridin-4-ylmet...)
Show SMILES C[C@H]1CN2CCN(Cc3ccncc3)C[C@H]2C[C@@]1(C)c1cccc(O)c1 |r|
Show InChI InChI=1S/C22H29N3O/c1-17-14-25-11-10-24(15-18-6-8-23-9-7-18)16-20(25)13-22(17,2)19-4-3-5-21(26)12-19/h3-9,12,17,20,26H,10-11,13-16H2,1-2H3/t17-,20+,22+/m0/s1
Reactome pathway
1.30E+3n/an/an/an/an/an/an/an/a
Adolor Corporation
Curated by ChEMBL
Assay Description
Displacement of [3H]diprenorphine from human cloned delta opioid receptor expressed in CHO cells
J Med Chem 49: 7290-306 (2006)
Article DOI: 10.1021/jm0604878
BindingDB Entry DOI: 10.7270/Q2CF9QW8
Mu-type opioid receptor
(Homo sapiens (Human))
BDBM50199908
(3-((7R,8R,9alphaR)-7,8-dimethyl-2-(pyridin-4-ylmet...)
Show SMILES C[C@H]1CN2CCN(Cc3ccncc3)C[C@H]2C[C@@]1(C)c1cccc(O)c1 |r|
Show InChI InChI=1S/C22H29N3O/c1-17-14-25-11-10-24(15-18-6-8-23-9-7-18)16-20(25)13-22(17,2)19-4-3-5-21(26)12-19/h3-9,12,17,20,26H,10-11,13-16H2,1-2H3/t17-,20+,22+/m0/s1
NCI pathway
Reactome pathway
n/an/a 18n/an/an/an/an/an/a
Adolor Corporation
Curated by ChEMBL
Assay Description
Antagonist activity assessed as inhibition of loperamide-stimulated [35S]GTPgammaS binding to human mu opioid receptor expressed in CHO cells
J Med Chem 49: 7290-306 (2006)
Article DOI: 10.1021/jm0604878
BindingDB Entry DOI: 10.7270/Q2CF9QW8