BDBM50199942 3-((7R,8R,9alphaR)-7,8-dimethyl-2-(4-methylbenzyl)-octahydro-1H-pyrido[1,2-R]pyrazin-8-yl)phenol::CHEMBL217999
SMILES: C[C@H]1CN2CCN(Cc3ccc(C)cc3)C[C@H]2C[C@@]1(C)c1cccc(O)c1
InChI Key: InChIKey=ZWDRGROQJMUOOH-BPUDTRNYSA-N
Data: 3 KI  1 IC50
Activity Spreadsheet -- Enzyme Inhibition Constant Data from BindingDB
Found 4 hits for monomerid = 50199942
Trg + Lig
Ki
nM
ΔG°
kcal/mole
IC50
nM
Kd
nM
EC50/IC50
nM
koff
s-1
kon
M-1s-1
pHTemp
°C
Mu-type opioid receptor
(Homo sapiens (Human))
BDBM50199942
(3-((7R,8R,9alphaR)-7,8-dimethyl-2-(4-methylbenzyl)...)
Show SMILES C[C@H]1CN2CCN(Cc3ccc(C)cc3)C[C@H]2C[C@@]1(C)c1cccc(O)c1 |r|
Show InChI InChI=1S/C24H32N2O/c1-18-7-9-20(10-8-18)16-25-11-12-26-15-19(2)24(3,14-22(26)17-25)21-5-4-6-23(27)13-21/h4-10,13,19,22,27H,11-12,14-17H2,1-3H3/t19-,22+,24+/m0/s1
NCI pathway
Reactome pathway
14n/an/an/an/an/an/an/an/a
Adolor Corporation
Curated by ChEMBL
Assay Description
Displacement of [3H]diprenorphine from human cloned mu opioid receptor expressed in CHO cells
J Med Chem 49: 7290-306 (2006)
Article DOI: 10.1021/jm0604878
BindingDB Entry DOI: 10.7270/Q2CF9QW8
Kappa-type opioid receptor
(Homo sapiens (Human))
BDBM50199942
(3-((7R,8R,9alphaR)-7,8-dimethyl-2-(4-methylbenzyl)...)
Show SMILES C[C@H]1CN2CCN(Cc3ccc(C)cc3)C[C@H]2C[C@@]1(C)c1cccc(O)c1 |r|
Show InChI InChI=1S/C24H32N2O/c1-18-7-9-20(10-8-18)16-25-11-12-26-15-19(2)24(3,14-22(26)17-25)21-5-4-6-23(27)13-21/h4-10,13,19,22,27H,11-12,14-17H2,1-3H3/t19-,22+,24+/m0/s1
Reactome pathway
300n/an/an/an/an/an/an/an/a
Adolor Corporation
Curated by ChEMBL
Assay Description
Antagonist activity assessed as inhibition of U50488-stimulated [35S]GTP-gamma-S binding to human kappa opioid receptor expressed in CHO cells
J Med Chem 49: 7290-306 (2006)
Article DOI: 10.1021/jm0604878
BindingDB Entry DOI: 10.7270/Q2CF9QW8
Delta-type opioid receptor
(Homo sapiens (Human))
BDBM50199942
(3-((7R,8R,9alphaR)-7,8-dimethyl-2-(4-methylbenzyl)...)
Show SMILES C[C@H]1CN2CCN(Cc3ccc(C)cc3)C[C@H]2C[C@@]1(C)c1cccc(O)c1 |r|
Show InChI InChI=1S/C24H32N2O/c1-18-7-9-20(10-8-18)16-25-11-12-26-15-19(2)24(3,14-22(26)17-25)21-5-4-6-23(27)13-21/h4-10,13,19,22,27H,11-12,14-17H2,1-3H3/t19-,22+,24+/m0/s1
Reactome pathway
350n/an/an/an/an/an/an/an/a
Adolor Corporation
Curated by ChEMBL
Assay Description
Displacement of [3H]diprenorphine from human cloned delta opioid receptor expressed in CHO cells
J Med Chem 49: 7290-306 (2006)
Article DOI: 10.1021/jm0604878
BindingDB Entry DOI: 10.7270/Q2CF9QW8
Mu-type opioid receptor
(Homo sapiens (Human))
BDBM50199942
(3-((7R,8R,9alphaR)-7,8-dimethyl-2-(4-methylbenzyl)...)
Show SMILES C[C@H]1CN2CCN(Cc3ccc(C)cc3)C[C@H]2C[C@@]1(C)c1cccc(O)c1 |r|
Show InChI InChI=1S/C24H32N2O/c1-18-7-9-20(10-8-18)16-25-11-12-26-15-19(2)24(3,14-22(26)17-25)21-5-4-6-23(27)13-21/h4-10,13,19,22,27H,11-12,14-17H2,1-3H3/t19-,22+,24+/m0/s1
NCI pathway
Reactome pathway
n/an/a 9.5n/an/an/an/an/an/a
Adolor Corporation
Curated by ChEMBL
Assay Description
Antagonist activity assessed as inhibition of loperamide-stimulated [35S]GTPgammaS binding to human mu opioid receptor expressed in CHO cells
J Med Chem 49: 7290-306 (2006)
Article DOI: 10.1021/jm0604878
BindingDB Entry DOI: 10.7270/Q2CF9QW8