BDBM50200190 (S)-2-amino-N-hydroxy-3-(2-iodophenyl)propanamide::CHEMBL376197
SMILES: N[C@@H](Cc1ccccc1I)C(=O)NO
InChI Key: InChIKey=VDVBDTOMINXTQL-QMMMGPOBSA-N
Data: 1 IC50
Activity Spreadsheet -- Enzyme Inhibition Constant Data from BindingDB
Found 1 hit for monomerid = 50200190
Trg + Lig
Ki
nM
ΔG°
kcal/mole
IC50
nM
Kd
nM
EC50/IC50
nM
koff
s-1
kon
M-1s-1
pHTemp
°C
Tyrosine-protein kinase CSK
(Homo sapiens (Human))
BDBM50200190
((S)-2-amino-N-hydroxy-3-(2-iodophenyl)propanamide ...)
Show SMILES N[C@@H](Cc1ccccc1I)C(=O)NO |r|
Show InChI InChI=1S/C9H11IN2O2/c10-7-4-2-1-3-6(7)5-8(11)9(13)12-14/h1-4,8,14H,5,11H2,(H,12,13)/t8-/m0/s1
NCI pathway
Reactome pathway
n/an/a 3.40E+3n/an/an/an/an/an/a
University of Rhode Island
Curated by ChEMBL
Assay Description
Inhibition of CSK measured as poly-E4Y phosphorylation by acid precipitation assay in presence of 0.2 mM CoCl2
J Med Chem 49: 7532-9 (2006)
Article DOI: 10.1021/jm061058c
BindingDB Entry DOI: 10.7270/Q2SQ9029