BDBM50200464 CHEMBL3982888
SMILES: CC(C)C[C@H](NC(=O)[C@H](Cc1ccc(O)cc1)NC(=O)[C@H](CCC(O)=O)NC(=O)CNC(=O)[C@@H](NC(=O)[C@H](CCC(O)=O)NC(=O)[C@@H]1CCCN1C(=O)[C@H](CC(O)=O)NC(=O)[C@H](CC(C)C)NC(C)=O)[C@@H](C)O)C(O)=O
InChI Key: InChIKey=GWCBAFZZIRQCKW-PKNHJFCNSA-N
Data: 1 IC50  1 Kd
Activity Spreadsheet -- Enzyme Inhibition Constant Data from BindingDB
Found 2 hits for monomerid = 50200464
Trg + Lig
Ki
nM
ΔG°
kcal/mole
IC50
nM
Kd
nM
EC50/IC50
nM
koff
s-1
kon
M-1s-1
pHTemp
°C
Kelch-like ECH-associated protein 1
(Homo sapiens (Human))
BDBM50200464
(CHEMBL3982888)
Show SMILES CC(C)C[C@H](NC(=O)[C@H](Cc1ccc(O)cc1)NC(=O)[C@H](CCC(O)=O)NC(=O)CNC(=O)[C@@H](NC(=O)[C@H](CCC(O)=O)NC(=O)[C@@H]1CCCN1C(=O)[C@H](CC(O)=O)NC(=O)[C@H](CC(C)C)NC(C)=O)[C@@H](C)O)C(O)=O |r|
Show InChI InChI=1S/C48H71N9O19/c1-23(2)18-31(50-26(6)59)43(70)54-33(21-39(66)67)47(74)57-17-7-8-35(57)45(72)52-30(14-16-38(64)65)42(69)56-40(25(5)58)46(73)49-22-36(61)51-29(13-15-37(62)63)41(68)53-32(20-27-9-11-28(60)12-10-27)44(71)55-34(48(75)76)19-24(3)4/h9-12,23-25,29-35,40,58,60H,7-8,13-22H2,1-6H3,(H,49,73)(H,50,59)(H,51,61)(H,52,72)(H,53,68)(H,54,70)(H,55,71)(H,56,69)(H,62,63)(H,64,65)(H,66,67)(H,75,76)/t25-,29+,30+,31+,32+,33+,34+,35+,40+/m1/s1
n/an/an/a 47n/an/an/an/an/a
China Pharmaceutical University
Curated by ChEMBL
Assay Description
Binding affinity to Keap1 (unknown origin) Kelch domain by ITC assay
J Med Chem 59: 10837-10858 (2016)
Article DOI: 10.1021/acs.jmedchem.6b00586
BindingDB Entry DOI: 10.7270/Q2377BPQ
Kelch-like ECH-associated protein 1
(Homo sapiens (Human))
BDBM50200464
(CHEMBL3982888)
Show SMILES CC(C)C[C@H](NC(=O)[C@H](Cc1ccc(O)cc1)NC(=O)[C@H](CCC(O)=O)NC(=O)CNC(=O)[C@@H](NC(=O)[C@H](CCC(O)=O)NC(=O)[C@@H]1CCCN1C(=O)[C@H](CC(O)=O)NC(=O)[C@H](CC(C)C)NC(C)=O)[C@@H](C)O)C(O)=O |r|
Show InChI InChI=1S/C48H71N9O19/c1-23(2)18-31(50-26(6)59)43(70)54-33(21-39(66)67)47(74)57-17-7-8-35(57)45(72)52-30(14-16-38(64)65)42(69)56-40(25(5)58)46(73)49-22-36(61)51-29(13-15-37(62)63)41(68)53-32(20-27-9-11-28(60)12-10-27)44(71)55-34(48(75)76)19-24(3)4/h9-12,23-25,29-35,40,58,60H,7-8,13-22H2,1-6H3,(H,49,73)(H,50,59)(H,51,61)(H,52,72)(H,53,68)(H,54,70)(H,55,71)(H,56,69)(H,62,63)(H,64,65)(H,66,67)(H,75,76)/t25-,29+,30+,31+,32+,33+,34+,35+,40+/m1/s1
n/an/a 30n/an/an/an/an/an/a
China Pharmaceutical University
Curated by ChEMBL
Assay Description
Inhibition of Keap1 Kelch domain (unknown origin) interaction with Nrf2 assessed as displacement of FITC-betaAla-DEETGEF-OH from Keap1 Kelch domain b...
J Med Chem 59: 10837-10858 (2016)
Article DOI: 10.1021/acs.jmedchem.6b00586
BindingDB Entry DOI: 10.7270/Q2377BPQ