BDBM50200535 CHEMBL3913823
SMILES: CCc1cc2C(=O)c3c([nH]c4cc(ccc34)C#N)C(C)(C)c2cc1N1CCN(CC2(O)CCCCC2)CC1
InChI Key: InChIKey=RATQAJNCLDLWPK-UHFFFAOYSA-N
Data: 1 IC50
Activity Spreadsheet -- Enzyme Inhibition Constant Data from BindingDB
Found 1 hit for monomerid = 50200535
Trg + Lig
Ki
nM
ΔG°
kcal/mole
IC50
nM
Kd
nM
EC50/IC50
nM
koff
s-1
kon
M-1s-1
pHTemp
°C
ALK tyrosine kinase receptor
(Homo sapiens (Human))
BDBM50200535
(CHEMBL3913823)
Show SMILES CCc1cc2C(=O)c3c([nH]c4cc(ccc34)C#N)C(C)(C)c2cc1N1CCN(CC2(O)CCCCC2)CC1
Show InChI InChI=1S/C32H38N4O2/c1-4-22-17-24-25(18-27(22)36-14-12-35(13-15-36)20-32(38)10-6-5-7-11-32)31(2,3)30-28(29(24)37)23-9-8-21(19-33)16-26(23)34-30/h8-9,16-18,34,38H,4-7,10-15,20H2,1-3H3
n/an/a 7n/an/an/an/an/an/a
Ocean University of China
Curated by ChEMBL
Assay Description
Inhibition of recombinant wild type ALK (unknown origin) using poly (Glu,Tyr)4:1 as substrate after 60 mins by ELISA
Bioorg Med Chem Lett 26: 5399-5402 (2016)
Article DOI: 10.1016/j.bmcl.2016.10.039
BindingDB Entry DOI: 10.7270/Q22809JW