BDBM50200542 5-hydroxy-3-(4-hydroxy-phenyl)-8,8-dimethyl-8H-pyrano[3,2-g]chromen-4-one::CHEMBL238628::alpinum isoflavone::alpinumisoflavone
SMILES: CC1(C)Oc2cc3occ(-c4ccc(O)cc4)c(=O)c3c(O)c2C=C1
InChI Key: InChIKey=RQAMSFTXEFSBPK-UHFFFAOYSA-N
Data: 1 IC50
Activity Spreadsheet -- Enzyme Inhibition Constant Data from BindingDB
Found 1 hit for monomerid = 50200542
Trg + Lig
Ki
nM
ΔG°
kcal/mole
IC50
nM
Kd
nM
EC50/IC50
nM
koff
s-1
kon
M-1s-1
pHTemp
°C
Protein-tyrosine phosphatase 1B
(Homo sapiens (Human))
BDBM50200542
(5-hydroxy-3-(4-hydroxy-phenyl)-8,8-dimethyl-8H-pyr...)
Show SMILES CC1(C)Oc2cc3occ(-c4ccc(O)cc4)c(=O)c3c(O)c2C=C1 |c:26|
Show InChI InChI=1S/C20H16O5/c1-20(2)8-7-13-15(25-20)9-16-17(18(13)22)19(23)14(10-24-16)11-3-5-12(21)6-4-11/h3-10,21-22H,1-2H3
NCI pathway
Reactome pathway
n/an/a 4.15E+4n/an/an/an/an/an/a
Korea Research Institute of Bioscience and Biotechnology
Curated by ChEMBL
Assay Description
Inhibition of human recombinant PTP1B
J Nat Prod 69: 1572-6 (2006)
Article DOI: 10.1021/np0601861
BindingDB Entry DOI: 10.7270/Q2B8591J