null
SMILES: CNC(=O)CN1CN(c2ccccc2)C2(CCN(CCC(Oc3cc(OC)ccc3C)C(C)C)CC2)C1=O
InChI Key: InChIKey=KLWASKREVYRVHL-UHFFFAOYSA-N
Activity Spreadsheet -- Enzyme Inhibition Constant Data from BindingDB
Found 5 hits for monomerid = 50200589
Trg + Lig
Ki
nM
ΔG°
kcal/mole
IC50
nM
Kd
nM
EC50/IC50
nM
koff
s-1
kon
M-1s-1
pHTemp
°C
Nociceptin receptor
(Homo sapiens (Human))
BDBM50200589
(2-{8-[3-(5-methoxy-2-methyl-phenoxy)-4-methylpenty...)
Show SMILES CNC(=O)CN1CN(c2ccccc2)C2(CCN(CCC(Oc3cc(OC)ccc3C)C(C)C)CC2)C1=O |w:20.20|
Show InChI InChI=1S/C30H42N4O4/c1-22(2)26(38-27-19-25(37-5)12-11-23(27)3)13-16-32-17-14-30(15-18-32)29(36)33(20-28(35)31-4)21-34(30)24-9-7-6-8-10-24/h6-12,19,22,26H,13-18,20-21H2,1-5H3,(H,31,35)
Reactome pathway
2n/an/an/an/an/an/an/an/a
Organon Laboratories Ltd.
Curated by ChEMBL
Assay Description
Displacement of [3H]nociceptin from human NOP receptor expressed in CHO cells
Bioorg Med Chem 15: 1828-47 (2007)
Article DOI: 10.1016/j.bmc.2006.11.030
BindingDB Entry DOI: 10.7270/Q27S7NF2
Mu-type opioid receptor
(Homo sapiens (Human))
BDBM50200589
(2-{8-[3-(5-methoxy-2-methyl-phenoxy)-4-methylpenty...)
Show SMILES CNC(=O)CN1CN(c2ccccc2)C2(CCN(CCC(Oc3cc(OC)ccc3C)C(C)C)CC2)C1=O |w:20.20|
Show InChI InChI=1S/C30H42N4O4/c1-22(2)26(38-27-19-25(37-5)12-11-23(27)3)13-16-32-17-14-30(15-18-32)29(36)33(20-28(35)31-4)21-34(30)24-9-7-6-8-10-24/h6-12,19,22,26H,13-18,20-21H2,1-5H3,(H,31,35)
NCI pathway
Reactome pathway
16n/an/an/an/an/an/an/an/a
Organon Laboratories Ltd.
Curated by ChEMBL
Assay Description
Displacement of [3H]diprenorphine from human MOP receptor expressed in CHOK1 cells
Bioorg Med Chem 15: 1828-47 (2007)
Article DOI: 10.1016/j.bmc.2006.11.030
BindingDB Entry DOI: 10.7270/Q27S7NF2
Kappa-type opioid receptor
(Cavia porcellus (domestic guinea pig))
BDBM50200589
(2-{8-[3-(5-methoxy-2-methyl-phenoxy)-4-methylpenty...)
Show SMILES CNC(=O)CN1CN(c2ccccc2)C2(CCN(CCC(Oc3cc(OC)ccc3C)C(C)C)CC2)C1=O |w:20.20|
Show InChI InChI=1S/C30H42N4O4/c1-22(2)26(38-27-19-25(37-5)12-11-23(27)3)13-16-32-17-14-30(15-18-32)29(36)33(20-28(35)31-4)21-34(30)24-9-7-6-8-10-24/h6-12,19,22,26H,13-18,20-21H2,1-5H3,(H,31,35)
44n/an/an/an/an/an/an/an/a
Organon Laboratories Ltd.
Curated by ChEMBL
Assay Description
Displacement of [3H]U-69593 from KOP receptor in guinea pig cortical tissue
Bioorg Med Chem 15: 1828-47 (2007)
Article DOI: 10.1016/j.bmc.2006.11.030
BindingDB Entry DOI: 10.7270/Q27S7NF2
Delta-type opioid receptor
(Homo sapiens (Human))
BDBM50200589
(2-{8-[3-(5-methoxy-2-methyl-phenoxy)-4-methylpenty...)
Show SMILES CNC(=O)CN1CN(c2ccccc2)C2(CCN(CCC(Oc3cc(OC)ccc3C)C(C)C)CC2)C1=O |w:20.20|
Show InChI InChI=1S/C30H42N4O4/c1-22(2)26(38-27-19-25(37-5)12-11-23(27)3)13-16-32-17-14-30(15-18-32)29(36)33(20-28(35)31-4)21-34(30)24-9-7-6-8-10-24/h6-12,19,22,26H,13-18,20-21H2,1-5H3,(H,31,35)
Reactome pathway
320n/an/an/an/an/an/an/an/a
Organon Laboratories Ltd.
Curated by ChEMBL
Assay Description
Displacement of [3H]naltrindole from human DOP receptor expressed in deltaC6 cells
Bioorg Med Chem 15: 1828-47 (2007)
Article DOI: 10.1016/j.bmc.2006.11.030
BindingDB Entry DOI: 10.7270/Q27S7NF2
Nociceptin receptor
(Homo sapiens (Human))
BDBM50200589
(2-{8-[3-(5-methoxy-2-methyl-phenoxy)-4-methylpenty...)
Show SMILES CNC(=O)CN1CN(c2ccccc2)C2(CCN(CCC(Oc3cc(OC)ccc3C)C(C)C)CC2)C1=O |w:20.20|
Show InChI InChI=1S/C30H42N4O4/c1-22(2)26(38-27-19-25(37-5)12-11-23(27)3)13-16-32-17-14-30(15-18-32)29(36)33(20-28(35)31-4)21-34(30)24-9-7-6-8-10-24/h6-12,19,22,26H,13-18,20-21H2,1-5H3,(H,31,35)
Reactome pathway
n/an/a 17n/an/an/an/an/an/a
Organon Laboratories Ltd.
Curated by ChEMBL
Assay Description
Agonist activity at human NOP receptor expressed in CHO cells assessed as inhibition of forskolin-stimulated cAMP production after 2 hrs
Bioorg Med Chem 15: 1828-47 (2007)
Article DOI: 10.1016/j.bmc.2006.11.030
BindingDB Entry DOI: 10.7270/Q27S7NF2