BDBM50200592 (+)-2-(3-{1-[3-(5-methoxy-2-methyl-phenoxy)-4-methyl-pentyl]-piperidin-4-yl}-2-oxo-2,3-dihydro-benzimidazol-1-yl)-N-methyl-acetamide::(+/-)-2-(3-(1-(3-(5-methoxy-2-methylphenoxy)-4-methylpentyl)piperidin-4-yl)-2-oxo-2,3-dihydro-1H-benzo[d]imidazol-1-yl)-N-methylacetamide::(-)-2-(3-{1-[3-(5-methoxy-2-methyl-phenoxy)-4-methyl-pentyl]-piperidin-4-yl}-2-oxo-2,3-dihydro-benzimidazol-1-yl)-N-methyl-acetamide::2-(3-(1-(3-(5-methoxy-2-methylphenoxy)-4-methylpentyl)piperidin-4-yl)-2-oxo-2,3-dihydrobenzo[d]imidazol-1-yl)-N-methylacetamide::2-(3-{1-[3-(5-methoxy-2-methyl-phenoxy)-4-methyl-pentyl]-piperidin-4-yl}-2-oxo-2,3-dihydro-benzimidazol-1-yl)-N-methyl-acetamide::CHEMBL391487
SMILES: CNC(=O)Cn1c2ccccc2n(C2CCN(CCC(Oc3cc(OC)ccc3C)C(C)C)CC2)c1=O
InChI Key: InChIKey=OUDYUUVZVNMOPP-UHFFFAOYSA-N
Data: 9 KI  2 IC50
Activity Spreadsheet -- Enzyme Inhibition Constant Data from BindingDB
Found 11 hits for monomerid = 50200592
Trg + Lig
Ki
nM
ΔG°
kcal/mole
IC50
nM
Kd
nM
EC50/IC50
nM
koff
s-1
kon
M-1s-1
pHTemp
°C
Nociceptin receptor
(Homo sapiens (Human))
BDBM50200592
((+)-2-(3-{1-[3-(5-methoxy-2-methyl-phenoxy)-4-meth...)
Show SMILES CNC(=O)Cn1c2ccccc2n(C2CCN(CCC(Oc3cc(OC)ccc3C)C(C)C)CC2)c1=O |w:19.20|
Show InChI InChI=1S/C29H40N4O4/c1-20(2)26(37-27-18-23(36-5)11-10-21(27)3)14-17-31-15-12-22(13-16-31)33-25-9-7-6-8-24(25)32(29(33)35)19-28(34)30-4/h6-11,18,20,22,26H,12-17,19H2,1-5H3,(H,30,34)
Reactome pathway
1n/an/an/an/an/an/an/an/a
Organon Laboratories Ltd
Curated by ChEMBL
Assay Description
Displacement of [3H]nociceptin from human NOP receptor expressed in CHO cells
Bioorg Med Chem 16: 2829-51 (2008)
Article DOI: 10.1016/j.bmc.2008.01.005
BindingDB Entry DOI: 10.7270/Q2C82D2D
Potassium voltage-gated channel subfamily H member 2
(Homo sapiens (Human))
BDBM50200592
((+)-2-(3-{1-[3-(5-methoxy-2-methyl-phenoxy)-4-meth...)
Show SMILES CNC(=O)Cn1c2ccccc2n(C2CCN(CCC(Oc3cc(OC)ccc3C)C(C)C)CC2)c1=O |w:19.20|
Show InChI InChI=1S/C29H40N4O4/c1-20(2)26(37-27-18-23(36-5)11-10-21(27)3)14-17-31-15-12-22(13-16-31)33-25-9-7-6-8-24(25)32(29(33)35)19-28(34)30-4/h6-11,18,20,22,26H,12-17,19H2,1-5H3,(H,30,34)
Reactome pathway
56n/an/an/an/an/an/an/an/a
Schering-Plough Research Institute
Curated by ChEMBL
Assay Description
Displacement of [3H]dofetilide from human ERG expressed in HEK293 cells
Bioorg Med Chem Lett 19: 6441-6 (2009)
Article DOI: 10.1016/j.bmcl.2009.09.028
BindingDB Entry DOI: 10.7270/Q21J99W7
Nociceptin receptor
(Homo sapiens (Human))
BDBM50200592
((+)-2-(3-{1-[3-(5-methoxy-2-methyl-phenoxy)-4-meth...)
Show SMILES CNC(=O)Cn1c2ccccc2n(C2CCN(CCC(Oc3cc(OC)ccc3C)C(C)C)CC2)c1=O |w:19.20|
Show InChI InChI=1S/C29H40N4O4/c1-20(2)26(37-27-18-23(36-5)11-10-21(27)3)14-17-31-15-12-22(13-16-31)33-25-9-7-6-8-24(25)32(29(33)35)19-28(34)30-4/h6-11,18,20,22,26H,12-17,19H2,1-5H3,(H,30,34)
Reactome pathway
101n/an/an/an/an/an/an/an/a
Organon Laboratories Ltd.
Curated by ChEMBL
Assay Description
Displacement of [3H]nociceptin from human NOP receptor expressed in CHO cells
Bioorg Med Chem 15: 1828-47 (2007)
Article DOI: 10.1016/j.bmc.2006.11.030
BindingDB Entry DOI: 10.7270/Q27S7NF2
Mu-type opioid receptor
(Homo sapiens (Human))
BDBM50200592
((+)-2-(3-{1-[3-(5-methoxy-2-methyl-phenoxy)-4-meth...)
Show SMILES CNC(=O)Cn1c2ccccc2n(C2CCN(CCC(Oc3cc(OC)ccc3C)C(C)C)CC2)c1=O |w:19.20|
Show InChI InChI=1S/C29H40N4O4/c1-20(2)26(37-27-18-23(36-5)11-10-21(27)3)14-17-31-15-12-22(13-16-31)33-25-9-7-6-8-24(25)32(29(33)35)19-28(34)30-4/h6-11,18,20,22,26H,12-17,19H2,1-5H3,(H,30,34)
NCI pathway
Reactome pathway
166n/an/an/an/an/an/an/an/a
Organon Laboratories Ltd
Curated by ChEMBL
Assay Description
Displacement of [3H]Diprenorphine from human mu opioid receptor expressed in CHO cells
Bioorg Med Chem 16: 2829-51 (2008)
Article DOI: 10.1016/j.bmc.2008.01.005
BindingDB Entry DOI: 10.7270/Q2C82D2D
Mu-type opioid receptor
(Homo sapiens (Human))
BDBM50200592
((+)-2-(3-{1-[3-(5-methoxy-2-methyl-phenoxy)-4-meth...)
Show SMILES CNC(=O)Cn1c2ccccc2n(C2CCN(CCC(Oc3cc(OC)ccc3C)C(C)C)CC2)c1=O |w:19.20|
Show InChI InChI=1S/C29H40N4O4/c1-20(2)26(37-27-18-23(36-5)11-10-21(27)3)14-17-31-15-12-22(13-16-31)33-25-9-7-6-8-24(25)32(29(33)35)19-28(34)30-4/h6-11,18,20,22,26H,12-17,19H2,1-5H3,(H,30,34)
NCI pathway
Reactome pathway
449n/an/an/an/an/an/an/an/a
Organon Laboratories Ltd.
Curated by ChEMBL
Assay Description
Displacement of [3H]diprenorphine from human MOP receptor expressed in CHOK1 cells
Bioorg Med Chem 15: 1828-47 (2007)
Article DOI: 10.1016/j.bmc.2006.11.030
BindingDB Entry DOI: 10.7270/Q27S7NF2
Mu-type opioid receptor
(Homo sapiens (Human))
BDBM50200592
((+)-2-(3-{1-[3-(5-methoxy-2-methyl-phenoxy)-4-meth...)
Show SMILES CNC(=O)Cn1c2ccccc2n(C2CCN(CCC(Oc3cc(OC)ccc3C)C(C)C)CC2)c1=O |w:19.20|
Show InChI InChI=1S/C29H40N4O4/c1-20(2)26(37-27-18-23(36-5)11-10-21(27)3)14-17-31-15-12-22(13-16-31)33-25-9-7-6-8-24(25)32(29(33)35)19-28(34)30-4/h6-11,18,20,22,26H,12-17,19H2,1-5H3,(H,30,34)
NCI pathway
Reactome pathway
449n/an/an/an/an/an/an/an/a
Organon Laboratories Ltd.
Curated by ChEMBL
Assay Description
Displacement of [3H]diprenorphine from human MOP receptor expressed in CHOK1 cells
Bioorg Med Chem 15: 1828-47 (2007)
Article DOI: 10.1016/j.bmc.2006.11.030
BindingDB Entry DOI: 10.7270/Q27S7NF2
Kappa-type opioid receptor
(Cavia porcellus (domestic guinea pig))
BDBM50200592
((+)-2-(3-{1-[3-(5-methoxy-2-methyl-phenoxy)-4-meth...)
Show SMILES CNC(=O)Cn1c2ccccc2n(C2CCN(CCC(Oc3cc(OC)ccc3C)C(C)C)CC2)c1=O |w:19.20|
Show InChI InChI=1S/C29H40N4O4/c1-20(2)26(37-27-18-23(36-5)11-10-21(27)3)14-17-31-15-12-22(13-16-31)33-25-9-7-6-8-24(25)32(29(33)35)19-28(34)30-4/h6-11,18,20,22,26H,12-17,19H2,1-5H3,(H,30,34)
477n/an/an/an/an/an/an/an/a
Organon Laboratories Ltd.
Curated by ChEMBL
Assay Description
Displacement of [3H]U-69593 from KOP receptor in guinea pig cortical tissue
Bioorg Med Chem 15: 1828-47 (2007)
Article DOI: 10.1016/j.bmc.2006.11.030
BindingDB Entry DOI: 10.7270/Q27S7NF2
Kappa-type opioid receptor
(Cavia porcellus (domestic guinea pig))
BDBM50200592
((+)-2-(3-{1-[3-(5-methoxy-2-methyl-phenoxy)-4-meth...)
Show SMILES CNC(=O)Cn1c2ccccc2n(C2CCN(CCC(Oc3cc(OC)ccc3C)C(C)C)CC2)c1=O |w:19.20|
Show InChI InChI=1S/C29H40N4O4/c1-20(2)26(37-27-18-23(36-5)11-10-21(27)3)14-17-31-15-12-22(13-16-31)33-25-9-7-6-8-24(25)32(29(33)35)19-28(34)30-4/h6-11,18,20,22,26H,12-17,19H2,1-5H3,(H,30,34)
477n/an/an/an/an/an/an/an/a
Organon Laboratories Ltd.
Curated by ChEMBL
Assay Description
Displacement of [3H]U-69593 from KOP receptor in guinea pig cortical tissue
Bioorg Med Chem 15: 1828-47 (2007)
Article DOI: 10.1016/j.bmc.2006.11.030
BindingDB Entry DOI: 10.7270/Q27S7NF2
Delta-type opioid receptor
(Homo sapiens (Human))
BDBM50200592
((+)-2-(3-{1-[3-(5-methoxy-2-methyl-phenoxy)-4-meth...)
Show SMILES CNC(=O)Cn1c2ccccc2n(C2CCN(CCC(Oc3cc(OC)ccc3C)C(C)C)CC2)c1=O |w:19.20|
Show InChI InChI=1S/C29H40N4O4/c1-20(2)26(37-27-18-23(36-5)11-10-21(27)3)14-17-31-15-12-22(13-16-31)33-25-9-7-6-8-24(25)32(29(33)35)19-28(34)30-4/h6-11,18,20,22,26H,12-17,19H2,1-5H3,(H,30,34)
Reactome pathway
4.53E+3n/an/an/an/an/an/an/an/a
Organon Laboratories Ltd.
Curated by ChEMBL
Assay Description
Displacement of [3H]naltrindole from human DOP receptor expressed in deltaC6 cells
Bioorg Med Chem 15: 1828-47 (2007)
Article DOI: 10.1016/j.bmc.2006.11.030
BindingDB Entry DOI: 10.7270/Q27S7NF2
Nociceptin receptor
(Homo sapiens (Human))
BDBM50200592
((+)-2-(3-{1-[3-(5-methoxy-2-methyl-phenoxy)-4-meth...)
Show SMILES CNC(=O)Cn1c2ccccc2n(C2CCN(CCC(Oc3cc(OC)ccc3C)C(C)C)CC2)c1=O |w:19.20|
Show InChI InChI=1S/C29H40N4O4/c1-20(2)26(37-27-18-23(36-5)11-10-21(27)3)14-17-31-15-12-22(13-16-31)33-25-9-7-6-8-24(25)32(29(33)35)19-28(34)30-4/h6-11,18,20,22,26H,12-17,19H2,1-5H3,(H,30,34)
Reactome pathway
n/an/a 712n/an/an/an/an/an/a
Organon Laboratories Ltd.
Curated by ChEMBL
Assay Description
Agonist activity at human NOP receptor expressed in CHO cells assessed as inhibition of forskolin-stimulated cAMP production after 2 hrs
Bioorg Med Chem 15: 1828-47 (2007)
Article DOI: 10.1016/j.bmc.2006.11.030
BindingDB Entry DOI: 10.7270/Q27S7NF2
Nociceptin receptor
(Homo sapiens (Human))
BDBM50200592
((+)-2-(3-{1-[3-(5-methoxy-2-methyl-phenoxy)-4-meth...)
Show SMILES CNC(=O)Cn1c2ccccc2n(C2CCN(CCC(Oc3cc(OC)ccc3C)C(C)C)CC2)c1=O |w:19.20|
Show InChI InChI=1S/C29H40N4O4/c1-20(2)26(37-27-18-23(36-5)11-10-21(27)3)14-17-31-15-12-22(13-16-31)33-25-9-7-6-8-24(25)32(29(33)35)19-28(34)30-4/h6-11,18,20,22,26H,12-17,19H2,1-5H3,(H,30,34)
Reactome pathway
n/an/a 712n/an/an/an/an/an/a
Organon Laboratories Ltd.
Curated by ChEMBL
Assay Description
Agonist activity at human NOP receptor expressed in CHO cells assessed as inhibition of forskolin-stimulated cAMP production after 2 hrs
Bioorg Med Chem 15: 1828-47 (2007)
Article DOI: 10.1016/j.bmc.2006.11.030
BindingDB Entry DOI: 10.7270/Q27S7NF2