BDBM50200599 3-(3-{1-[3-(5-methoxy-2-methyl-phenoxy)-4-methylpentyl]-piperidin-4-yl}-2-oxo-2,3-dihydro-benzimidazol-1-yl)-propionic acid methyl ester::CHEMBL391234
SMILES: COC(=O)CCn1c2ccccc2n(C2CCN(CCC(Oc3cc(OC)ccc3C)C(C)C)CC2)c1=O
InChI Key: InChIKey=JFJLRJIRAMFOPA-UHFFFAOYSA-N
Data: 4 KI  1 IC50
Activity Spreadsheet -- Enzyme Inhibition Constant Data from BindingDB
Found 5 hits for monomerid = 50200599
Trg + Lig
Ki
nM
ΔG°
kcal/mole
IC50
nM
Kd
nM
EC50/IC50
nM
koff
s-1
kon
M-1s-1
pHTemp
°C
Nociceptin receptor
(Homo sapiens (Human))
BDBM50200599
(3-(3-{1-[3-(5-methoxy-2-methyl-phenoxy)-4-methylpe...)
Show SMILES COC(=O)CCn1c2ccccc2n(C2CCN(CCC(Oc3cc(OC)ccc3C)C(C)C)CC2)c1=O |w:20.21|
Show InChI InChI=1S/C30H41N3O5/c1-21(2)27(38-28-20-24(36-4)11-10-22(28)3)14-18-31-16-12-23(13-17-31)33-26-9-7-6-8-25(26)32(30(33)35)19-15-29(34)37-5/h6-11,20-21,23,27H,12-19H2,1-5H3
Reactome pathway
5n/an/an/an/an/an/an/an/a
Organon Laboratories Ltd.
Curated by ChEMBL
Assay Description
Displacement of [3H]nociceptin from human NOP receptor expressed in CHO cells
Bioorg Med Chem 15: 1828-47 (2007)
Article DOI: 10.1016/j.bmc.2006.11.030
BindingDB Entry DOI: 10.7270/Q27S7NF2
Mu-type opioid receptor
(Homo sapiens (Human))
BDBM50200599
(3-(3-{1-[3-(5-methoxy-2-methyl-phenoxy)-4-methylpe...)
Show SMILES COC(=O)CCn1c2ccccc2n(C2CCN(CCC(Oc3cc(OC)ccc3C)C(C)C)CC2)c1=O |w:20.21|
Show InChI InChI=1S/C30H41N3O5/c1-21(2)27(38-28-20-24(36-4)11-10-22(28)3)14-18-31-16-12-23(13-17-31)33-26-9-7-6-8-25(26)32(30(33)35)19-15-29(34)37-5/h6-11,20-21,23,27H,12-19H2,1-5H3
NCI pathway
Reactome pathway
271n/an/an/an/an/an/an/an/a
Organon Laboratories Ltd.
Curated by ChEMBL
Assay Description
Displacement of [3H]diprenorphine from human MOP receptor expressed in CHOK1 cells
Bioorg Med Chem 15: 1828-47 (2007)
Article DOI: 10.1016/j.bmc.2006.11.030
BindingDB Entry DOI: 10.7270/Q27S7NF2
Kappa-type opioid receptor
(Cavia porcellus (domestic guinea pig))
BDBM50200599
(3-(3-{1-[3-(5-methoxy-2-methyl-phenoxy)-4-methylpe...)
Show SMILES COC(=O)CCn1c2ccccc2n(C2CCN(CCC(Oc3cc(OC)ccc3C)C(C)C)CC2)c1=O |w:20.21|
Show InChI InChI=1S/C30H41N3O5/c1-21(2)27(38-28-20-24(36-4)11-10-22(28)3)14-18-31-16-12-23(13-17-31)33-26-9-7-6-8-25(26)32(30(33)35)19-15-29(34)37-5/h6-11,20-21,23,27H,12-19H2,1-5H3
671n/an/an/an/an/an/an/an/a
Organon Laboratories Ltd.
Curated by ChEMBL
Assay Description
Displacement of [3H]U-69593 from KOP receptor in guinea pig cortical tissue
Bioorg Med Chem 15: 1828-47 (2007)
Article DOI: 10.1016/j.bmc.2006.11.030
BindingDB Entry DOI: 10.7270/Q27S7NF2
Delta-type opioid receptor
(Homo sapiens (Human))
BDBM50200599
(3-(3-{1-[3-(5-methoxy-2-methyl-phenoxy)-4-methylpe...)
Show SMILES COC(=O)CCn1c2ccccc2n(C2CCN(CCC(Oc3cc(OC)ccc3C)C(C)C)CC2)c1=O |w:20.21|
Show InChI InChI=1S/C30H41N3O5/c1-21(2)27(38-28-20-24(36-4)11-10-22(28)3)14-18-31-16-12-23(13-17-31)33-26-9-7-6-8-25(26)32(30(33)35)19-15-29(34)37-5/h6-11,20-21,23,27H,12-19H2,1-5H3
Reactome pathway
3.08E+3n/an/an/an/an/an/an/an/a
Organon Laboratories Ltd.
Curated by ChEMBL
Assay Description
Displacement of [3H]naltrindole from human DOP receptor expressed in deltaC6 cells
Bioorg Med Chem 15: 1828-47 (2007)
Article DOI: 10.1016/j.bmc.2006.11.030
BindingDB Entry DOI: 10.7270/Q27S7NF2
Nociceptin receptor
(Homo sapiens (Human))
BDBM50200599
(3-(3-{1-[3-(5-methoxy-2-methyl-phenoxy)-4-methylpe...)
Show SMILES COC(=O)CCn1c2ccccc2n(C2CCN(CCC(Oc3cc(OC)ccc3C)C(C)C)CC2)c1=O |w:20.21|
Show InChI InChI=1S/C30H41N3O5/c1-21(2)27(38-28-20-24(36-4)11-10-22(28)3)14-18-31-16-12-23(13-17-31)33-26-9-7-6-8-25(26)32(30(33)35)19-15-29(34)37-5/h6-11,20-21,23,27H,12-19H2,1-5H3
Reactome pathway
n/an/a 123n/an/an/an/an/an/a
Organon Laboratories Ltd.
Curated by ChEMBL
Assay Description
Agonist activity at human NOP receptor expressed in CHO cells assessed as inhibition of forskolin-stimulated cAMP production after 2 hrs
Bioorg Med Chem 15: 1828-47 (2007)
Article DOI: 10.1016/j.bmc.2006.11.030
BindingDB Entry DOI: 10.7270/Q27S7NF2