BDBM50200607 2-(3-{1-[3-(5-methoxy-2-methyl-phenoxy)-4-methylpentyl]-piperidin-4-yl}-2-oxo-2,3-dihydro-benzimidazol-1-yl)-acetamide::CHEMBL391486
SMILES: COc1ccc(C)c(OC(CCN2CCC(CC2)n2c3ccccc3n(CC(N)=O)c2=O)C(C)C)c1
InChI Key: InChIKey=CDYNZSOUMBLDST-UHFFFAOYSA-N
Data: 4 KI  1 IC50
Activity Spreadsheet -- Enzyme Inhibition Constant Data from BindingDB
Found 5 hits for monomerid = 50200607
Trg + Lig
Ki
nM
ΔG°
kcal/mole
IC50
nM
Kd
nM
EC50/IC50
nM
koff
s-1
kon
M-1s-1
pHTemp
°C
Nociceptin receptor
(Homo sapiens (Human))
BDBM50200607
(2-(3-{1-[3-(5-methoxy-2-methyl-phenoxy)-4-methylpe...)
Show SMILES COc1ccc(C)c(OC(CCN2CCC(CC2)n2c3ccccc3n(CC(N)=O)c2=O)C(C)C)c1 |w:9.8|
Show InChI InChI=1S/C28H38N4O4/c1-19(2)25(36-26-17-22(35-4)10-9-20(26)3)13-16-30-14-11-21(12-15-30)32-24-8-6-5-7-23(24)31(28(32)34)18-27(29)33/h5-10,17,19,21,25H,11-16,18H2,1-4H3,(H2,29,33)
Reactome pathway
3n/an/an/an/an/an/an/an/a
Organon Laboratories Ltd.
Curated by ChEMBL
Assay Description
Displacement of [3H]nociceptin from human NOP receptor expressed in CHO cells
Bioorg Med Chem 15: 1828-47 (2007)
Article DOI: 10.1016/j.bmc.2006.11.030
BindingDB Entry DOI: 10.7270/Q27S7NF2
Mu-type opioid receptor
(Homo sapiens (Human))
BDBM50200607
(2-(3-{1-[3-(5-methoxy-2-methyl-phenoxy)-4-methylpe...)
Show SMILES COc1ccc(C)c(OC(CCN2CCC(CC2)n2c3ccccc3n(CC(N)=O)c2=O)C(C)C)c1 |w:9.8|
Show InChI InChI=1S/C28H38N4O4/c1-19(2)25(36-26-17-22(35-4)10-9-20(26)3)13-16-30-14-11-21(12-15-30)32-24-8-6-5-7-23(24)31(28(32)34)18-27(29)33/h5-10,17,19,21,25H,11-16,18H2,1-4H3,(H2,29,33)
NCI pathway
Reactome pathway
138n/an/an/an/an/an/an/an/a
Organon Laboratories Ltd.
Curated by ChEMBL
Assay Description
Displacement of [3H]diprenorphine from human MOP receptor expressed in CHOK1 cells
Bioorg Med Chem 15: 1828-47 (2007)
Article DOI: 10.1016/j.bmc.2006.11.030
BindingDB Entry DOI: 10.7270/Q27S7NF2
Kappa-type opioid receptor
(Cavia porcellus (domestic guinea pig))
BDBM50200607
(2-(3-{1-[3-(5-methoxy-2-methyl-phenoxy)-4-methylpe...)
Show SMILES COc1ccc(C)c(OC(CCN2CCC(CC2)n2c3ccccc3n(CC(N)=O)c2=O)C(C)C)c1 |w:9.8|
Show InChI InChI=1S/C28H38N4O4/c1-19(2)25(36-26-17-22(35-4)10-9-20(26)3)13-16-30-14-11-21(12-15-30)32-24-8-6-5-7-23(24)31(28(32)34)18-27(29)33/h5-10,17,19,21,25H,11-16,18H2,1-4H3,(H2,29,33)
503n/an/an/an/an/an/an/an/a
Organon Laboratories Ltd.
Curated by ChEMBL
Assay Description
Displacement of [3H]U-69593 from KOP receptor in guinea pig cortical tissue
Bioorg Med Chem 15: 1828-47 (2007)
Article DOI: 10.1016/j.bmc.2006.11.030
BindingDB Entry DOI: 10.7270/Q27S7NF2
Delta-type opioid receptor
(Homo sapiens (Human))
BDBM50200607
(2-(3-{1-[3-(5-methoxy-2-methyl-phenoxy)-4-methylpe...)
Show SMILES COc1ccc(C)c(OC(CCN2CCC(CC2)n2c3ccccc3n(CC(N)=O)c2=O)C(C)C)c1 |w:9.8|
Show InChI InChI=1S/C28H38N4O4/c1-19(2)25(36-26-17-22(35-4)10-9-20(26)3)13-16-30-14-11-21(12-15-30)32-24-8-6-5-7-23(24)31(28(32)34)18-27(29)33/h5-10,17,19,21,25H,11-16,18H2,1-4H3,(H2,29,33)
Reactome pathway
2.02E+3n/an/an/an/an/an/an/an/a
Organon Laboratories Ltd.
Curated by ChEMBL
Assay Description
Displacement of [3H]naltrindole from human DOP receptor expressed in deltaC6 cells
Bioorg Med Chem 15: 1828-47 (2007)
Article DOI: 10.1016/j.bmc.2006.11.030
BindingDB Entry DOI: 10.7270/Q27S7NF2
Nociceptin receptor
(Homo sapiens (Human))
BDBM50200607
(2-(3-{1-[3-(5-methoxy-2-methyl-phenoxy)-4-methylpe...)
Show SMILES COc1ccc(C)c(OC(CCN2CCC(CC2)n2c3ccccc3n(CC(N)=O)c2=O)C(C)C)c1 |w:9.8|
Show InChI InChI=1S/C28H38N4O4/c1-19(2)25(36-26-17-22(35-4)10-9-20(26)3)13-16-30-14-11-21(12-15-30)32-24-8-6-5-7-23(24)31(28(32)34)18-27(29)33/h5-10,17,19,21,25H,11-16,18H2,1-4H3,(H2,29,33)
Reactome pathway
n/an/a 32n/an/an/an/an/an/a
Organon Laboratories Ltd.
Curated by ChEMBL
Assay Description
Agonist activity at human NOP receptor expressed in CHO cells assessed as inhibition of forskolin-stimulated cAMP production after 2 hrs
Bioorg Med Chem 15: 1828-47 (2007)
Article DOI: 10.1016/j.bmc.2006.11.030
BindingDB Entry DOI: 10.7270/Q27S7NF2