BDBM50200831 CHEMBL374791::N-((2S,3S)-4-(4-chlorophenyl)-3-phenylbutan-2-yl)-2-methyl-2-(pyridin-2-yloxy)propanamide::N-[(1S,2S)-3-(4-chlorophenyl)-1-methyl-2-phenyl-propyl]-2-(2-pyridyloxy)-2-methylpropanamide
SMILES: C[C@H](NC(=O)C(C)(C)Oc1ccccn1)[C@@H](Cc1ccc(Cl)cc1)c1ccccc1
InChI Key: InChIKey=KSKXQOGPSBZBSW-PGRDOPGGSA-N
Data: 3 IC50
Activity Spreadsheet -- Enzyme Inhibition Constant Data from BindingDB
Found 3 hits for monomerid = 50200831
Trg + Lig
Ki
nM
ΔG°
kcal/mole
IC50
nM
Kd
nM
EC50/IC50
nM
koff
s-1
kon
M-1s-1
pHTemp
°C
Cannabinoid receptor 1
(Homo sapiens (Human))
BDBM50200831
(CHEMBL374791 | N-((2S,3S)-4-(4-chlorophenyl)-3-phe...)
Show SMILES C[C@H](NC(=O)C(C)(C)Oc1ccccn1)[C@@H](Cc1ccc(Cl)cc1)c1ccccc1 |r|
Show InChI InChI=1S/C25H27ClN2O2/c1-18(28-24(29)25(2,3)30-23-11-7-8-16-27-23)22(20-9-5-4-6-10-20)17-19-12-14-21(26)15-13-19/h4-16,18,22H,17H2,1-3H3,(H,28,29)/t18-,22+/m0/s1
NCI pathway
Reactome pathway
n/an/a 1.80n/an/an/an/an/an/a
Merck Research Laboratories
Curated by ChEMBL
Assay Description
Displacement of [3H]CP55940 from human CB1 receptor expressed in CHO cells
J Med Chem 51: 4359-69 (2008)
Article DOI: 10.1021/jm800219f
BindingDB Entry DOI: 10.7270/Q28915N5
Cannabinoid receptor 2
(Homo sapiens (Human))
BDBM50200831
(CHEMBL374791 | N-((2S,3S)-4-(4-chlorophenyl)-3-phe...)
Show SMILES C[C@H](NC(=O)C(C)(C)Oc1ccccn1)[C@@H](Cc1ccc(Cl)cc1)c1ccccc1 |r|
Show InChI InChI=1S/C25H27ClN2O2/c1-18(28-24(29)25(2,3)30-23-11-7-8-16-27-23)22(20-9-5-4-6-10-20)17-19-12-14-21(26)15-13-19/h4-16,18,22H,17H2,1-3H3,(H,28,29)/t18-,22+/m0/s1
Reactome pathway
n/an/a 88n/an/an/an/an/an/a
Merck Research Laboratories
Curated by ChEMBL
Assay Description
Inhibition of [3H]CP-55940 binding to human recombinant CB2 receptor in CHO cells
J Med Chem 49: 7584-7 (2006)
Article DOI: 10.1021/jm060996+
BindingDB Entry DOI: 10.7270/Q2QN67KG
Cannabinoid receptor 1
(Homo sapiens (Human))
BDBM50200831
(CHEMBL374791 | N-((2S,3S)-4-(4-chlorophenyl)-3-phe...)
Show SMILES C[C@H](NC(=O)C(C)(C)Oc1ccccn1)[C@@H](Cc1ccc(Cl)cc1)c1ccccc1 |r|
Show InChI InChI=1S/C25H27ClN2O2/c1-18(28-24(29)25(2,3)30-23-11-7-8-16-27-23)22(20-9-5-4-6-10-20)17-19-12-14-21(26)15-13-19/h4-16,18,22H,17H2,1-3H3,(H,28,29)/t18-,22+/m0/s1
NCI pathway
Reactome pathway
n/an/a 1.80n/an/an/an/an/an/a
Merck Research Laboratories
Curated by ChEMBL
Assay Description
Inhibition of [3H]CP-55940 binding to human recombinant CB1 receptor in CHO cells
J Med Chem 49: 7584-7 (2006)
Article DOI: 10.1021/jm060996+
BindingDB Entry DOI: 10.7270/Q2QN67KG