BDBM50200842 CHEMBL374291::N-[2,3-bis(4-chlorophenyl)-1-methylpropyl]-2-(4-chlorophenyloxy)-2-methylpropanamide
SMILES: CC(NC(=O)C(C)(C)Oc1ccc(Cl)cc1)C(Cc1ccc(Cl)cc1)c1ccc(Cl)cc1
InChI Key: InChIKey=HAMLZAXSMZZNHH-UHFFFAOYSA-N
Data: 2 IC50
Activity Spreadsheet -- Enzyme Inhibition Constant Data from BindingDB
Found 2 hits for monomerid = 50200842
Trg + Lig
Ki
nM
ΔG°
kcal/mole
IC50
nM
Kd
nM
EC50/IC50
nM
koff
s-1
kon
M-1s-1
pHTemp
°C
Cannabinoid receptor 2
(Homo sapiens (Human))
BDBM50200842
(CHEMBL374291 | N-[2,3-bis(4-chlorophenyl)-1-methyl...)
Show SMILES CC(NC(=O)C(C)(C)Oc1ccc(Cl)cc1)C(Cc1ccc(Cl)cc1)c1ccc(Cl)cc1
Show InChI InChI=1S/C26H26Cl3NO2/c1-17(30-25(31)26(2,3)32-23-14-12-22(29)13-15-23)24(19-6-10-21(28)11-7-19)16-18-4-8-20(27)9-5-18/h4-15,17,24H,16H2,1-3H3,(H,30,31)
Reactome pathway
n/an/a 1.10E+3n/an/an/an/an/an/a
Merck Research Laboratories
Curated by ChEMBL
Assay Description
Inhibition of [3H]CP-55940 binding to human recombinant CB2 receptor in CHO cells
J Med Chem 49: 7584-7 (2006)
Article DOI: 10.1021/jm060996+
BindingDB Entry DOI: 10.7270/Q2QN67KG
Cannabinoid receptor 1
(Homo sapiens (Human))
BDBM50200842
(CHEMBL374291 | N-[2,3-bis(4-chlorophenyl)-1-methyl...)
Show SMILES CC(NC(=O)C(C)(C)Oc1ccc(Cl)cc1)C(Cc1ccc(Cl)cc1)c1ccc(Cl)cc1
Show InChI InChI=1S/C26H26Cl3NO2/c1-17(30-25(31)26(2,3)32-23-14-12-22(29)13-15-23)24(19-6-10-21(28)11-7-19)16-18-4-8-20(27)9-5-18/h4-15,17,24H,16H2,1-3H3,(H,30,31)
NCI pathway
Reactome pathway
n/an/a 20n/an/an/an/an/an/a
Merck Research Laboratories
Curated by ChEMBL
Assay Description
Inhibition of [3H]CP-55940 binding to human recombinant CB1 receptor in CHO cells
J Med Chem 49: 7584-7 (2006)
Article DOI: 10.1021/jm060996+
BindingDB Entry DOI: 10.7270/Q2QN67KG