BDBM50200882 (R)-3-(2-(2,2-dimethyl-1-(5-methylfuran-2-yl)propylamino)-3,4-dioxocyclobut-1-enylamino)-2-hydroxy-N,N-dimethylbenzamide::CHEMBL376414
SMILES: CN(C)C(=O)c1cccc(Nc2c(N[C@@H](c3ccc(C)o3)C(C)(C)C)c(=O)c2=O)c1O
InChI Key: InChIKey=MYFOCPUZNAPZSE-NRFANRHFSA-N
Data: 2 IC50
Activity Spreadsheet -- Enzyme Inhibition Constant Data from BindingDB
Found 2 hits for monomerid = 50200882
Trg + Lig
Ki
nM
ΔG°
kcal/mole
IC50
nM
Kd
nM
EC50/IC50
nM
koff
s-1
kon
M-1s-1
pHTemp
°C
C-X-C chemokine receptor type 1
(Homo sapiens (Human))
BDBM50200882
((R)-3-(2-(2,2-dimethyl-1-(5-methylfuran-2-yl)propy...)
Show SMILES CN(C)C(=O)c1cccc(Nc2c(N[C@@H](c3ccc(C)o3)C(C)(C)C)c(=O)c2=O)c1O |r|
Show InChI InChI=1S/C23H27N3O5/c1-12-10-11-15(31-12)21(23(2,3)4)25-17-16(19(28)20(17)29)24-14-9-7-8-13(18(14)27)22(30)26(5)6/h7-11,21,24-25,27H,1-6H3/t21-/m0/s1
n/an/a 11n/an/an/an/an/an/a
Schering-Plough Research Institute
Curated by ChEMBL
Assay Description
Displacement of [125I]hCXCL8 from human CXCR1 receptor expressed in BaF3 cells
J Med Chem 49: 7603-6 (2006)
Article DOI: 10.1021/jm0609622
BindingDB Entry DOI: 10.7270/Q2KW5GVR
C-X-C chemokine receptor type 2
(Homo sapiens (Human))
BDBM50200882
((R)-3-(2-(2,2-dimethyl-1-(5-methylfuran-2-yl)propy...)
Show SMILES CN(C)C(=O)c1cccc(Nc2c(N[C@@H](c3ccc(C)o3)C(C)(C)C)c(=O)c2=O)c1O |r|
Show InChI InChI=1S/C23H27N3O5/c1-12-10-11-15(31-12)21(23(2,3)4)25-17-16(19(28)20(17)29)24-14-9-7-8-13(18(14)27)22(30)26(5)6/h7-11,21,24-25,27H,1-6H3/t21-/m0/s1
Reactome pathway
n/an/a 3.80n/an/an/an/an/an/a
Schering-Plough Research Institute
Curated by ChEMBL
Assay Description
Displacement of [125I]hCXCL8 from human CXCR2 receptor expressed in BaF3 cells
J Med Chem 49: 7603-6 (2006)
Article DOI: 10.1021/jm0609622
BindingDB Entry DOI: 10.7270/Q2KW5GVR