null
SMILES: COc1cc2[C@H]3CC[C@]4(C)[C@H](CC[C@H]4[C@@H]3CCc2cc1OS(N)(=O)=O)OS(N)(=O)=O
InChI Key: InChIKey=AQSNIXKAKUZPSI-SSTWWWIQSA-N
PDB links: 1 PDB ID matches this monomer.
Activity Spreadsheet -- Enzyme Inhibition Constant Data from BindingDB
Found 8 hits for monomerid = 50200936
Trg + Lig
Ki
nM
ΔG°
kcal/mole
IC50
nM
Kd
nM
EC50/IC50
nM
koff
s-1
kon
M-1s-1
pHTemp
°C
Carbonic anhydrase 2
(Homo sapiens (Human))
BDBM50200936
((9BETA,13ALPHA,14BETA,17ALPHA)-2-METHOXYESTRA-1,3,...)
Show SMILES COc1cc2[C@H]3CC[C@]4(C)[C@H](CC[C@H]4[C@@H]3CCc2cc1OS(N)(=O)=O)OS(N)(=O)=O |r|
Show InChI InChI=1S/C19H28N2O7S2/c1-19-8-7-12-13(15(19)5-6-18(19)28-30(21,24)25)4-3-11-9-17(27-29(20,22)23)16(26-2)10-14(11)12/h9-10,12-13,15,18H,3-8H2,1-2H3,(H2,20,22,23)(H2,21,24,25)/t12-,13+,15-,18-,19-/m0/s1
Reactome pathway
n/an/a 379n/an/an/an/an/an/a
University of Bath
Curated by ChEMBL
Assay Description
Inhibition of human CA2
J Med Chem 49: 7683-96 (2006)
Article DOI: 10.1021/jm060705x
BindingDB Entry DOI: 10.7270/Q2Z89C2X
3D
3D Structure (crystal)
Steryl-sulfatase
(Homo sapiens (Human))
BDBM50200936
((9BETA,13ALPHA,14BETA,17ALPHA)-2-METHOXYESTRA-1,3,...)
Show SMILES COc1cc2[C@H]3CC[C@]4(C)[C@H](CC[C@H]4[C@@H]3CCc2cc1OS(N)(=O)=O)OS(N)(=O)=O |r|
Show InChI InChI=1S/C19H28N2O7S2/c1-19-8-7-12-13(15(19)5-6-18(19)28-30(21,24)25)4-3-11-9-17(27-29(20,22)23)16(26-2)10-14(11)12/h9-10,12-13,15,18H,3-8H2,1-2H3,(H2,20,22,23)(H2,21,24,25)/t12-,13+,15-,18-,19-/m0/s1
n/an/a 39n/an/an/an/an/an/a
University of Bath
Curated by ChEMBL
Assay Description
Inhibition of STS in placental microsomes by radiometric assay
J Med Chem 49: 7683-96 (2006)
Article DOI: 10.1021/jm060705x
BindingDB Entry DOI: 10.7270/Q2Z89C2X
Steryl-sulfatase
(Homo sapiens (Human))
BDBM50200936
((9BETA,13ALPHA,14BETA,17ALPHA)-2-METHOXYESTRA-1,3,...)
Show SMILES COc1cc2[C@H]3CC[C@]4(C)[C@H](CC[C@H]4[C@@H]3CCc2cc1OS(N)(=O)=O)OS(N)(=O)=O |r|
Show InChI InChI=1S/C19H28N2O7S2/c1-19-8-7-12-13(15(19)5-6-18(19)28-30(21,24)25)4-3-11-9-17(27-29(20,22)23)16(26-2)10-14(11)12/h9-10,12-13,15,18H,3-8H2,1-2H3,(H2,20,22,23)(H2,21,24,25)/t12-,13+,15-,18-,19-/m0/s1
n/an/a 39n/an/an/an/an/an/a
University of Bath
Curated by ChEMBL
Assay Description
Inhibition of steroid sulfatase-mediated coversion of [3H]E1S to E1
J Med Chem 51: 1295-308 (2008)
Article DOI: 10.1021/jm701319c
BindingDB Entry DOI: 10.7270/Q2M0468S
Carbonic anhydrase 2
(Homo sapiens (Human))
BDBM50200936
((9BETA,13ALPHA,14BETA,17ALPHA)-2-METHOXYESTRA-1,3,...)
Show SMILES COc1cc2[C@H]3CC[C@]4(C)[C@H](CC[C@H]4[C@@H]3CCc2cc1OS(N)(=O)=O)OS(N)(=O)=O |r|
Show InChI InChI=1S/C19H28N2O7S2/c1-19-8-7-12-13(15(19)5-6-18(19)28-30(21,24)25)4-3-11-9-17(27-29(20,22)23)16(26-2)10-14(11)12/h9-10,12-13,15,18H,3-8H2,1-2H3,(H2,20,22,23)(H2,21,24,25)/t12-,13+,15-,18-,19-/m0/s1
Reactome pathway
n/an/an/a 3.75E+3n/an/an/an/an/a
University of Florida
Curated by ChEMBL
Assay Description
Inhibition of carbonic anhydrase 2 (unknown origin) by isothermal calorimetry assay
J Med Chem 62: 2202-2212 (2019)
Article DOI: 10.1021/acs.jmedchem.8b01990
BindingDB Entry DOI: 10.7270/Q2765JSP
3D
3D Structure (crystal)
Carbonic anhydrase 2
(Homo sapiens (Human))
BDBM50200936
((9BETA,13ALPHA,14BETA,17ALPHA)-2-METHOXYESTRA-1,3,...)
Show SMILES COc1cc2[C@H]3CC[C@]4(C)[C@H](CC[C@H]4[C@@H]3CCc2cc1OS(N)(=O)=O)OS(N)(=O)=O |r|
Show InChI InChI=1S/C19H28N2O7S2/c1-19-8-7-12-13(15(19)5-6-18(19)28-30(21,24)25)4-3-11-9-17(27-29(20,22)23)16(26-2)10-14(11)12/h9-10,12-13,15,18H,3-8H2,1-2H3,(H2,20,22,23)(H2,21,24,25)/t12-,13+,15-,18-,19-/m0/s1
Reactome pathway
270n/an/an/an/an/an/an/an/a
University of Florida
Curated by ChEMBL
Assay Description
Inhibition of carbonic anhydrase 2 (unknown origin) by stopped-flow CO2 hydration assay
J Med Chem 62: 2202-2212 (2019)
Article DOI: 10.1021/acs.jmedchem.8b01990
BindingDB Entry DOI: 10.7270/Q2765JSP
3D
3D Structure (crystal)
Carbonic anhydrase 9
(Homo sapiens (Human))
BDBM50200936
((9BETA,13ALPHA,14BETA,17ALPHA)-2-METHOXYESTRA-1,3,...)
Show SMILES COc1cc2[C@H]3CC[C@]4(C)[C@H](CC[C@H]4[C@@H]3CCc2cc1OS(N)(=O)=O)OS(N)(=O)=O |r|
Show InChI InChI=1S/C19H28N2O7S2/c1-19-8-7-12-13(15(19)5-6-18(19)28-30(21,24)25)4-3-11-9-17(27-29(20,22)23)16(26-2)10-14(11)12/h9-10,12-13,15,18H,3-8H2,1-2H3,(H2,20,22,23)(H2,21,24,25)/t12-,13+,15-,18-,19-/m0/s1
NCI pathway
Reactome pathway
70n/an/an/an/an/an/an/an/a
University of Florida
Curated by ChEMBL
Assay Description
Inhibition of carbonic anhydrase 9 (unknown origin) expressed in Escherichia coli BL21 by stopped-flow CO2 hydration assay
J Med Chem 62: 2202-2212 (2019)
Article DOI: 10.1021/acs.jmedchem.8b01990
BindingDB Entry DOI: 10.7270/Q2765JSP
Carbonic anhydrase 9
(Homo sapiens (Human))
BDBM50200936
((9BETA,13ALPHA,14BETA,17ALPHA)-2-METHOXYESTRA-1,3,...)
Show SMILES COc1cc2[C@H]3CC[C@]4(C)[C@H](CC[C@H]4[C@@H]3CCc2cc1OS(N)(=O)=O)OS(N)(=O)=O |r|
Show InChI InChI=1S/C19H28N2O7S2/c1-19-8-7-12-13(15(19)5-6-18(19)28-30(21,24)25)4-3-11-9-17(27-29(20,22)23)16(26-2)10-14(11)12/h9-10,12-13,15,18H,3-8H2,1-2H3,(H2,20,22,23)(H2,21,24,25)/t12-,13+,15-,18-,19-/m0/s1
NCI pathway
Reactome pathway
n/an/an/a 605n/an/an/an/an/a
University of Florida
Curated by ChEMBL
Assay Description
Inhibition of carbonic anhydrase 9 (unknown origin) expressed in Escherichia coli BL21 by isothermal calorimetry assay
J Med Chem 62: 2202-2212 (2019)
Article DOI: 10.1021/acs.jmedchem.8b01990
BindingDB Entry DOI: 10.7270/Q2765JSP
Carbonic anhydrase 2
(Homo sapiens (Human))
BDBM50200936
((9BETA,13ALPHA,14BETA,17ALPHA)-2-METHOXYESTRA-1,3,...)
Show SMILES COc1cc2[C@H]3CC[C@]4(C)[C@H](CC[C@H]4[C@@H]3CCc2cc1OS(N)(=O)=O)OS(N)(=O)=O |r|
Show InChI InChI=1S/C19H28N2O7S2/c1-19-8-7-12-13(15(19)5-6-18(19)28-30(21,24)25)4-3-11-9-17(27-29(20,22)23)16(26-2)10-14(11)12/h9-10,12-13,15,18H,3-8H2,1-2H3,(H2,20,22,23)(H2,21,24,25)/t12-,13+,15-,18-,19-/m0/s1
Reactome pathway
n/an/a 379n/an/an/an/an/an/a
University of Bath
Curated by ChEMBL
Assay Description
Inhibition of human carbonic anhydrase 2
J Med Chem 51: 1295-308 (2008)
Article DOI: 10.1021/jm701319c
BindingDB Entry DOI: 10.7270/Q2M0468S
3D
3D Structure (crystal)