BDBM50200940 (13ALPHA,14BETA,17ALPHA)-3-HYDROXY-2-METHOXYESTRA-1,3,5(10)-TRIEN-17-YL SULFAMATE::2-methoxyestradiol 17-O-sulfamate::2-methoxyestradiol-17-O-sulfamate::CHEMBL374721
SMILES: COc1cc2[C@H]3CC[C@]4(C)[C@H](CC[C@H]4[C@@H]3CCc2cc1O)OS(N)(=O)=O
InChI Key: InChIKey=AOEHUXLJSHGXHN-SSTWWWIQSA-N
Data: 2 KI  2 IC50
PDB links: 1 PDB ID matches this monomer.
Activity Spreadsheet -- Enzyme Inhibition Constant Data from BindingDB
Found 4 hits for monomerid = 50200940
Trg + Lig
Ki
nM
ΔG°
kcal/mole
IC50
nM
Kd
nM
EC50/IC50
nM
koff
s-1
kon
M-1s-1
pHTemp
°C
Carbonic anhydrases; II & IX
(Homo sapiens (Human))
BDBM50200940
((13ALPHA,14BETA,17ALPHA)-3-HYDROXY-2-METHOXYESTRA-...)
Show SMILES COc1cc2[C@H]3CC[C@]4(C)[C@H](CC[C@H]4[C@@H]3CCc2cc1O)OS(N)(=O)=O |r|
Show InChI InChI=1S/C19H27NO5S/c1-19-8-7-12-13(15(19)5-6-18(19)25-26(20,22)23)4-3-11-9-16(21)17(24-2)10-14(11)12/h9-10,12-13,15,18,21H,3-8H2,1-2H3,(H2,20,22,23)/t12-,13+,15-,18-,19-/m0/s1
NCI pathway
Reactome pathway
1.18E+3n/an/an/an/an/an/an/an/a
University of Florida
Curated by ChEMBL
Assay Description
Inhibition of carbonic anhydrase 9 (unknown origin) expressed in Escherichia coli BL21 by stopped-flow CO2 hydration assay
J Med Chem 62: 2202-2212 (2019)
Article DOI: 10.1021/acs.jmedchem.8b01990
Carbonic anhydrase 2
(Homo sapiens (Human))
BDBM50200940
((13ALPHA,14BETA,17ALPHA)-3-HYDROXY-2-METHOXYESTRA-...)
Show SMILES COc1cc2[C@H]3CC[C@]4(C)[C@H](CC[C@H]4[C@@H]3CCc2cc1O)OS(N)(=O)=O |r|
Show InChI InChI=1S/C19H27NO5S/c1-19-8-7-12-13(15(19)5-6-18(19)25-26(20,22)23)4-3-11-9-16(21)17(24-2)10-14(11)12/h9-10,12-13,15,18,21H,3-8H2,1-2H3,(H2,20,22,23)/t12-,13+,15-,18-,19-/m0/s1
Reactome pathway
1.03E+4n/an/an/an/an/an/an/an/a
University of Florida
Curated by ChEMBL
Assay Description
Inhibition of carbonic anhydrase 2 (unknown origin) by stopped-flow CO2 hydration assay
J Med Chem 62: 2202-2212 (2019)
Article DOI: 10.1021/acs.jmedchem.8b01990
3D
3D Structure (crystal)
Carbonic anhydrase 2
(Homo sapiens (Human))
BDBM50200940
((13ALPHA,14BETA,17ALPHA)-3-HYDROXY-2-METHOXYESTRA-...)
Show SMILES COc1cc2[C@H]3CC[C@]4(C)[C@H](CC[C@H]4[C@@H]3CCc2cc1O)OS(N)(=O)=O |r|
Show InChI InChI=1S/C19H27NO5S/c1-19-8-7-12-13(15(19)5-6-18(19)25-26(20,22)23)4-3-11-9-16(21)17(24-2)10-14(11)12/h9-10,12-13,15,18,21H,3-8H2,1-2H3,(H2,20,22,23)/t12-,13+,15-,18-,19-/m0/s1
Reactome pathway
n/an/a 526n/an/an/an/an/an/a
University of Bath
Curated by ChEMBL
Assay Description
Inhibition of human CA2
J Med Chem 49: 7683-96 (2006)
Article DOI: 10.1021/jm060705x
BindingDB Entry DOI: 10.7270/Q2Z89C2X
3D
3D Structure (crystal)
Carbonic anhydrase 2
(Homo sapiens (Human))
BDBM50200940
((13ALPHA,14BETA,17ALPHA)-3-HYDROXY-2-METHOXYESTRA-...)
Show SMILES COc1cc2[C@H]3CC[C@]4(C)[C@H](CC[C@H]4[C@@H]3CCc2cc1O)OS(N)(=O)=O |r|
Show InChI InChI=1S/C19H27NO5S/c1-19-8-7-12-13(15(19)5-6-18(19)25-26(20,22)23)4-3-11-9-16(21)17(24-2)10-14(11)12/h9-10,12-13,15,18,21H,3-8H2,1-2H3,(H2,20,22,23)/t12-,13+,15-,18-,19-/m0/s1
Reactome pathway
n/an/a 526n/an/an/an/an/an/a
University of Bath
Curated by ChEMBL
Assay Description
Inhibition of human carbonic anhydrase 2
J Med Chem 51: 1295-308 (2008)
Article DOI: 10.1021/jm701319c
BindingDB Entry DOI: 10.7270/Q2M0468S
3D
3D Structure (crystal)