BDBM50200948 CHEMBL386847::cyclopentyl (2S,3S)-3-[4-([4-(2,5-dimethylphenyl)piperazin-1-yl]methyl)-1H-1,2,3-triazol-1-yl]-1,4-diphenylbutan-2-ylcarbamate::cyclopentyl (2S,3S)-3-[5-([4-(2,5-dimethylphenyl)piperazin-1-yl]methyl)-1H-1,2,3-triazol-1-yl]-1,4-diphenylbutan-2-ylcarbamate
SMILES: Cc1ccc(C)c(c1)N1CCN(Cc2cn(nn2)[C@@H](Cc2ccccc2)[C@H](Cc2ccccc2)NC(=O)OC2CCCC2)CC1
InChI Key: InChIKey=KUAKEQSMHJWJBL-GIWKVKTRSA-N
Data: 1 KI  1 IC50
Activity Spreadsheet -- Enzyme Inhibition Constant Data from BindingDB
Found 2 hits for monomerid = 50200948
Trg + Lig
Ki
nM
ΔG°
kcal/mole
IC50
nM
Kd
nM
EC50/IC50
nM
koff
s-1
kon
M-1s-1
pHTemp
°C
Human immunodeficiency virus type 1 protease
(Human immunodeficiency virus type 1)
BDBM50200948
(CHEMBL386847 | cyclopentyl (2S,3S)-3-[4-([4-(2,5-d...)
Show SMILES Cc1ccc(C)c(c1)N1CCN(Cc2cn(nn2)[C@@H](Cc2ccccc2)[C@H](Cc2ccccc2)NC(=O)OC2CCCC2)CC1 |r|
Show InChI InChI=1S/C37H46N6O2/c1-28-17-18-29(2)35(23-28)42-21-19-41(20-22-42)26-32-27-43(40-39-32)36(25-31-13-7-4-8-14-31)34(24-30-11-5-3-6-12-30)38-37(44)45-33-15-9-10-16-33/h3-8,11-14,17-18,23,27,33-34,36H,9-10,15-16,19-22,24-26H2,1-2H3,(H,38,44)/t34-,36-/m0/s1
32n/an/an/an/an/an/an/an/a
The Scripps Research Institute
Curated by ChEMBL
Assay Description
Inhibition of HIV1 protease
J Med Chem 49: 7697-710 (2006)
Article DOI: 10.1021/jm060754+
BindingDB Entry DOI: 10.7270/Q2TH8MB6
Human immunodeficiency virus type 1 protease
(Human immunodeficiency virus type 1)
BDBM50200948
(CHEMBL386847 | cyclopentyl (2S,3S)-3-[4-([4-(2,5-d...)
Show SMILES Cc1ccc(C)c(c1)N1CCN(Cc2cn(nn2)[C@@H](Cc2ccccc2)[C@H](Cc2ccccc2)NC(=O)OC2CCCC2)CC1 |r|
Show InChI InChI=1S/C37H46N6O2/c1-28-17-18-29(2)35(23-28)42-21-19-41(20-22-42)26-32-27-43(40-39-32)36(25-31-13-7-4-8-14-31)34(24-30-11-5-3-6-12-30)38-37(44)45-33-15-9-10-16-33/h3-8,11-14,17-18,23,27,33-34,36H,9-10,15-16,19-22,24-26H2,1-2H3,(H,38,44)/t34-,36-/m0/s1
n/an/a>2.50E+4n/an/an/an/an/an/a
The Scripps Research Institute
Curated by ChEMBL
Assay Description
Inhibition of HIV1 protease
J Med Chem 49: 7697-710 (2006)
Article DOI: 10.1021/jm060754+
BindingDB Entry DOI: 10.7270/Q2TH8MB6