BDBM50201043 CHEMBL3920231
SMILES: CN1CCN(Cc2ccc(cc2)-c2cn3CCCCC(O)CCCCCNc4ncc2c3n4)CC1
InChI Key: InChIKey=SDWTWVXMBPUQSC-UHFFFAOYSA-N
Data: 4 IC50  1 EC50
Activity Spreadsheet -- Enzyme Inhibition Constant Data from BindingDB
Found 5 hits for monomerid = 50201043
Trg + Lig
Ki
nM
ΔG°
kcal/mole
IC50
nM
Kd
nM
EC50/IC50
nM
koff
s-1
kon
M-1s-1
pHTemp
°C
Receptor-type tyrosine-protein kinase FLT3
(Homo sapiens (Human))
BDBM50201043
(CHEMBL3920231)
Show SMILES CN1CCN(Cc2ccc(cc2)-c2cn3CCCCC(O)CCCCCNc4ncc2c3n4)CC1
Show InChI InChI=1S/C28H40N6O/c1-32-15-17-33(18-16-32)20-22-9-11-23(12-10-22)26-21-34-14-6-4-8-24(35)7-3-2-5-13-29-28-30-19-25(26)27(34)31-28/h9-12,19,21,24,35H,2-8,13-18,20H2,1H3,(H,29,30,31)
n/an/a 29n/an/an/an/an/an/a
University of North Carolina at Chapel Hill
Curated by ChEMBL
Assay Description
Inhibition of Flt3 (unknown origin) by microfluidic capillary electrophoresis assay
ACS Med Chem Lett 7: 1044-1049 (2016)
Article DOI: 10.1021/acsmedchemlett.6b00221
BindingDB Entry DOI: 10.7270/Q208679K
Tyrosine-protein kinase Mer
(Homo sapiens (Human))
BDBM50201043
(CHEMBL3920231)
Show SMILES CN1CCN(Cc2ccc(cc2)-c2cn3CCCCC(O)CCCCCNc4ncc2c3n4)CC1
Show InChI InChI=1S/C28H40N6O/c1-32-15-17-33(18-16-32)20-22-9-11-23(12-10-22)26-21-34-14-6-4-8-24(35)7-3-2-5-13-29-28-30-19-25(26)27(34)31-28/h9-12,19,21,24,35H,2-8,13-18,20H2,1H3,(H,29,30,31)
Reactome pathway
n/an/an/an/a 150n/an/an/an/a
University of North Carolina at Chapel Hill
Curated by ChEMBL
Assay Description
Inhibition of human MerTK kinase domain (1585 to 3000 residues) expressed in HEK293 cells co-expressing rat EGFR LBD assessed as inhibition of EGF-st...
ACS Med Chem Lett 7: 1044-1049 (2016)
Article DOI: 10.1021/acsmedchemlett.6b00221
BindingDB Entry DOI: 10.7270/Q208679K
Tyrosine-protein kinase receptor TYRO3
(Homo sapiens (Human))
BDBM50201043
(CHEMBL3920231)
Show SMILES CN1CCN(Cc2ccc(cc2)-c2cn3CCCCC(O)CCCCCNc4ncc2c3n4)CC1
Show InChI InChI=1S/C28H40N6O/c1-32-15-17-33(18-16-32)20-22-9-11-23(12-10-22)26-21-34-14-6-4-8-24(35)7-3-2-5-13-29-28-30-19-25(26)27(34)31-28/h9-12,19,21,24,35H,2-8,13-18,20H2,1H3,(H,29,30,31)
n/an/a 170n/an/an/an/an/an/a
University of North Carolina at Chapel Hill
Curated by ChEMBL
Assay Description
Inhibition of Tyro3 (unknown origin) by microfluidic capillary electrophoresis assay
ACS Med Chem Lett 7: 1044-1049 (2016)
Article DOI: 10.1021/acsmedchemlett.6b00221
BindingDB Entry DOI: 10.7270/Q208679K
Tyrosine-protein kinase Mer
(Homo sapiens (Human))
BDBM50201043
(CHEMBL3920231)
Show SMILES CN1CCN(Cc2ccc(cc2)-c2cn3CCCCC(O)CCCCCNc4ncc2c3n4)CC1
Show InChI InChI=1S/C28H40N6O/c1-32-15-17-33(18-16-32)20-22-9-11-23(12-10-22)26-21-34-14-6-4-8-24(35)7-3-2-5-13-29-28-30-19-25(26)27(34)31-28/h9-12,19,21,24,35H,2-8,13-18,20H2,1H3,(H,29,30,31)
Reactome pathway
n/an/a 8n/an/an/an/an/an/a
University of North Carolina at Chapel Hill
Curated by ChEMBL
Assay Description
Inhibition of MerTK (unknown origin) by microfluidic capillary electrophoresis assay
ACS Med Chem Lett 7: 1044-1049 (2016)
Article DOI: 10.1021/acsmedchemlett.6b00221
BindingDB Entry DOI: 10.7270/Q208679K
Tyrosine-protein kinase receptor UFO
(Homo sapiens (Human))
BDBM50201043
(CHEMBL3920231)
Show SMILES CN1CCN(Cc2ccc(cc2)-c2cn3CCCCC(O)CCCCCNc4ncc2c3n4)CC1
Show InChI InChI=1S/C28H40N6O/c1-32-15-17-33(18-16-32)20-22-9-11-23(12-10-22)26-21-34-14-6-4-8-24(35)7-3-2-5-13-29-28-30-19-25(26)27(34)31-28/h9-12,19,21,24,35H,2-8,13-18,20H2,1H3,(H,29,30,31)
n/an/a 120n/an/an/an/an/an/a
University of North Carolina at Chapel Hill
Curated by ChEMBL
Assay Description
Inhibition of Axl (unknown origin) by microfluidic capillary electrophoresis assay
ACS Med Chem Lett 7: 1044-1049 (2016)
Article DOI: 10.1021/acsmedchemlett.6b00221
BindingDB Entry DOI: 10.7270/Q208679K