BDBM50201058 (1S,6R)-5-(3,8-diaza-bicyclo[4.2.0]oct-3-yl)-nicotinonitrile::5-((1S,6R)-3,8-diaza-bicyclo[4.2.0]octan-3-yl)nicotinonitrile::CHEMBL374515
SMILES: N#Cc1cncc(c1)N1CC[C@@H]2CN[C@@H]2C1
InChI Key: InChIKey=DHAPEAFRILEWCS-ZYHUDNBSSA-N
Data: 3 EC50
Activity Spreadsheet -- Enzyme Inhibition Constant Data from BindingDB
Found 3 hits for monomerid = 50201058
Trg + Lig
Ki
nM
ΔG°
kcal/mole
IC50
nM
Kd
nM
EC50/IC50
nM
koff
s-1
kon
M-1s-1
pHTemp
°C
Neuronal acetylcholine receptor Alpha-4/Beta-2
(Homo sapiens (Human))
BDBM50201058
((1S,6R)-5-(3,8-diaza-bicyclo[4.2.0]oct-3-yl)-nicot...)
Show SMILES N#Cc1cncc(c1)N1CC[C@@H]2CN[C@@H]2C1 |r|
Show InChI InChI=1S/C12H14N4/c13-4-9-3-11(7-14-5-9)16-2-1-10-6-15-12(10)8-16/h3,5,7,10,12,15H,1-2,6,8H2/t10-,12-/m1/s1
NCI pathway
Reactome pathway
n/an/an/an/a 1.90E+3n/an/an/an/a
Abbott Laboratories
Curated by ChEMBL
Assay Description
Agonist activity at human alpha4beta2 ACHR expressed in HEK293 cells assessed as change in intracellular calcium concentration by FLIPR
J Med Chem 49: 7843-53 (2006)
Article DOI: 10.1021/jm060846z
BindingDB Entry DOI: 10.7270/Q28G8MZZ
Cholinergic, Nicotinic Alpha3Beta2
(Homo sapiens (Human))
BDBM50201058
((1S,6R)-5-(3,8-diaza-bicyclo[4.2.0]oct-3-yl)-nicot...)
Show SMILES N#Cc1cncc(c1)N1CC[C@@H]2CN[C@@H]2C1 |r|
Show InChI InChI=1S/C12H14N4/c13-4-9-3-11(7-14-5-9)16-2-1-10-6-15-12(10)8-16/h3,5,7,10,12,15H,1-2,6,8H2/t10-,12-/m1/s1
n/an/an/an/a 490n/an/an/an/a
Burnham Institute for Medical Research
Curated by ChEMBL
Assay Description
Agonist activity against human alpha3beta4 nAChR
Bioorg Med Chem Lett 19: 127-31 (2008)
Article DOI: 10.1016/j.bmcl.2008.11.016
BindingDB Entry DOI: 10.7270/Q2T154WM
Neuronal acetylcholine receptor subunit alpha-4
(Homo sapiens (Human))
BDBM50201058
((1S,6R)-5-(3,8-diaza-bicyclo[4.2.0]oct-3-yl)-nicot...)
Show SMILES N#Cc1cncc(c1)N1CC[C@@H]2CN[C@@H]2C1 |r|
Show InChI InChI=1S/C12H14N4/c13-4-9-3-11(7-14-5-9)16-2-1-10-6-15-12(10)8-16/h3,5,7,10,12,15H,1-2,6,8H2/t10-,12-/m1/s1
n/an/an/an/a 1.91E+3n/an/an/an/a
Burnham Institute for Medical Research
Curated by ChEMBL
Assay Description
Agonist activity against human alpha4beta2 nAChR
Bioorg Med Chem Lett 19: 127-31 (2008)
Article DOI: 10.1016/j.bmcl.2008.11.016
BindingDB Entry DOI: 10.7270/Q2T154WM