BDBM50201072 (1R,6S)-3-(6-bromo-5-methoxy-pyridin-3-yl)-3,8-diaza-bicyclo[4.2.0]octane::(1R,6S)-3-(6-bromo-5-methoxypyridin-3-yl)-3,8-diaza-bicyclo[4.2.0]octane::CHEMBL218192
SMILES: COc1cc(cnc1Br)N1CC[C@H]2CN[C@H]2C1
InChI Key: InChIKey=FJKQHBMPUUMOOC-WPRPVWTQSA-N
Data: 3 EC50
Activity Spreadsheet -- Enzyme Inhibition Constant Data from BindingDB
Found 3 hits for monomerid = 50201072
Trg + Lig
Ki
nM
ΔG°
kcal/mole
IC50
nM
Kd
nM
EC50/IC50
nM
koff
s-1
kon
M-1s-1
pHTemp
°C
Neuronal acetylcholine receptor Alpha-4/Beta-2
(Homo sapiens (Human))
BDBM50201072
((1R,6S)-3-(6-bromo-5-methoxy-pyridin-3-yl)-3,8-dia...)
Show SMILES COc1cc(cnc1Br)N1CC[C@H]2CN[C@H]2C1 |r|
Show InChI InChI=1S/C12H16BrN3O/c1-17-11-4-9(6-15-12(11)13)16-3-2-8-5-14-10(8)7-16/h4,6,8,10,14H,2-3,5,7H2,1H3/t8-,10-/m0/s1
NCI pathway
Reactome pathway
n/an/an/an/a 21n/an/an/an/a
Abbott Laboratories
Curated by ChEMBL
Assay Description
Agonist activity at human alpha4beta2 ACHR expressed in HEK293 cells assessed as change in intracellular calcium concentration by FLIPR
J Med Chem 49: 7843-53 (2006)
Article DOI: 10.1021/jm060846z
BindingDB Entry DOI: 10.7270/Q28G8MZZ
Cholinergic, Nicotinic Alpha3Beta2
(Homo sapiens (Human))
BDBM50201072
((1R,6S)-3-(6-bromo-5-methoxy-pyridin-3-yl)-3,8-dia...)
Show SMILES COc1cc(cnc1Br)N1CC[C@H]2CN[C@H]2C1 |r|
Show InChI InChI=1S/C12H16BrN3O/c1-17-11-4-9(6-15-12(11)13)16-3-2-8-5-14-10(8)7-16/h4,6,8,10,14H,2-3,5,7H2,1H3/t8-,10-/m0/s1
n/an/an/an/a 7.94n/an/an/an/a
Burnham Institute for Medical Research
Curated by ChEMBL
Assay Description
Agonist activity against human alpha3beta4 nAChR
Bioorg Med Chem Lett 19: 127-31 (2008)
Article DOI: 10.1016/j.bmcl.2008.11.016
BindingDB Entry DOI: 10.7270/Q2T154WM
Neuronal acetylcholine receptor subunit alpha-4
(Homo sapiens (Human))
BDBM50201072
((1R,6S)-3-(6-bromo-5-methoxy-pyridin-3-yl)-3,8-dia...)
Show SMILES COc1cc(cnc1Br)N1CC[C@H]2CN[C@H]2C1 |r|
Show InChI InChI=1S/C12H16BrN3O/c1-17-11-4-9(6-15-12(11)13)16-3-2-8-5-14-10(8)7-16/h4,6,8,10,14H,2-3,5,7H2,1H3/t8-,10-/m0/s1
n/an/an/an/a 20.9n/an/an/an/a
Burnham Institute for Medical Research
Curated by ChEMBL
Assay Description
Agonist activity against human alpha4beta2 nAChR
Bioorg Med Chem Lett 19: 127-31 (2008)
Article DOI: 10.1016/j.bmcl.2008.11.016
BindingDB Entry DOI: 10.7270/Q2T154WM