null
SMILES: Cc1ccccc1C(C)(C)CC(O)(Cn1ccc(=O)c2ccccc12)C(F)(F)F
InChI Key: InChIKey=ZREYWBOITVVPOZ-UHFFFAOYSA-N
Activity Spreadsheet -- Enzyme Inhibition Constant Data from BindingDB
Found 3 hits for monomerid = 50201097
Trg + Lig
Ki
nM
ΔG°
kcal/mole
IC50
nM
Kd
nM
EC50/IC50
nM
koff
s-1
kon
M-1s-1
pHTemp
°C
Progesterone receptor
(Homo sapiens (Human))
BDBM50201097
(1-[2-hydroxy-4-methyl-4-o-tolyl-2-(trifluoromethyl...)
Show SMILES Cc1ccccc1C(C)(C)CC(O)(Cn1ccc(=O)c2ccccc12)C(F)(F)F
Show InChI InChI=1S/C23H24F3NO2/c1-16-8-4-6-10-18(16)21(2,3)14-22(29,23(24,25)26)15-27-13-12-20(28)17-9-5-7-11-19(17)27/h4-13,29H,14-15H2,1-3H3
n/an/a 240n/an/an/an/an/an/a
Boehringer Ingelheim Pharmaceuticals
Curated by ChEMBL
Assay Description
Inhibition of tetramethylrhodamine labeled RU486 binding to PR by FP assay
J Med Chem 49: 7887-96 (2006)
Article DOI: 10.1021/jm061273t
BindingDB Entry DOI: 10.7270/Q2BG2PTB
Glucocorticoid receptor
(Homo sapiens (Human))
BDBM50201097
(1-[2-hydroxy-4-methyl-4-o-tolyl-2-(trifluoromethyl...)
Show SMILES Cc1ccccc1C(C)(C)CC(O)(Cn1ccc(=O)c2ccccc12)C(F)(F)F
Show InChI InChI=1S/C23H24F3NO2/c1-16-8-4-6-10-18(16)21(2,3)14-22(29,23(24,25)26)15-27-13-12-20(28)17-9-5-7-11-19(17)27/h4-13,29H,14-15H2,1-3H3
n/an/a 22n/an/an/an/an/an/a
Boehringer Ingelheim Pharmaceuticals
Curated by ChEMBL
Assay Description
Inhibition of tetramethylrhodamine labeled dexamethosone binding to GR by FP assay
J Med Chem 49: 7887-96 (2006)
Article DOI: 10.1021/jm061273t
BindingDB Entry DOI: 10.7270/Q2BG2PTB
Mineralocorticoid receptor
(Homo sapiens (Human))
BDBM50201097
(1-[2-hydroxy-4-methyl-4-o-tolyl-2-(trifluoromethyl...)
Show SMILES Cc1ccccc1C(C)(C)CC(O)(Cn1ccc(=O)c2ccccc12)C(F)(F)F
Show InChI InChI=1S/C23H24F3NO2/c1-16-8-4-6-10-18(16)21(2,3)14-22(29,23(24,25)26)15-27-13-12-20(28)17-9-5-7-11-19(17)27/h4-13,29H,14-15H2,1-3H3
n/an/a 150n/an/an/an/an/an/a
Boehringer Ingelheim Pharmaceuticals
Curated by ChEMBL
Assay Description
Inhibition of tetramethylrhodamine labeled dexamethosone binding to MR by FP assay
J Med Chem 49: 7887-96 (2006)
Article DOI: 10.1021/jm061273t
BindingDB Entry DOI: 10.7270/Q2BG2PTB