null
SMILES: CC(C)(CC(O)(Cn1ccc(=O)c2ccccc12)C(F)(F)F)c1ccccc1
InChI Key: InChIKey=LCTFQUGGLDHXTH-UHFFFAOYSA-N
Activity Spreadsheet -- Enzyme Inhibition Constant Data from BindingDB
Found 3 hits for monomerid = 50201102
Trg + Lig
Ki
nM
ΔG°
kcal/mole
IC50
nM
Kd
nM
EC50/IC50
nM
koff
s-1
kon
M-1s-1
pHTemp
°C
Progesterone receptor
(Homo sapiens (Human))
BDBM50201102
(1-(2-hydroxy-4-methyl-4-phenyl-2-(trifluoromethyl)...)
Show SMILES CC(C)(CC(O)(Cn1ccc(=O)c2ccccc12)C(F)(F)F)c1ccccc1
Show InChI InChI=1S/C22H22F3NO2/c1-20(2,16-8-4-3-5-9-16)14-21(28,22(23,24)25)15-26-13-12-19(27)17-10-6-7-11-18(17)26/h3-13,28H,14-15H2,1-2H3
n/an/a 106n/an/an/an/an/an/a
Boehringer Ingelheim Pharmaceuticals
Curated by ChEMBL
Assay Description
Inhibition of tetramethylrhodamine labeled RU486 binding to PR by FP assay
J Med Chem 49: 7887-96 (2006)
Article DOI: 10.1021/jm061273t
BindingDB Entry DOI: 10.7270/Q2BG2PTB
Glucocorticoid receptor
(Homo sapiens (Human))
BDBM50201102
(1-(2-hydroxy-4-methyl-4-phenyl-2-(trifluoromethyl)...)
Show SMILES CC(C)(CC(O)(Cn1ccc(=O)c2ccccc12)C(F)(F)F)c1ccccc1
Show InChI InChI=1S/C22H22F3NO2/c1-20(2,16-8-4-3-5-9-16)14-21(28,22(23,24)25)15-26-13-12-19(27)17-10-6-7-11-18(17)26/h3-13,28H,14-15H2,1-2H3
n/an/a 28n/an/an/an/an/an/a
Boehringer Ingelheim Pharmaceuticals
Curated by ChEMBL
Assay Description
Inhibition of tetramethylrhodamine labeled dexamethosone binding to GR by FP assay
J Med Chem 49: 7887-96 (2006)
Article DOI: 10.1021/jm061273t
BindingDB Entry DOI: 10.7270/Q2BG2PTB
Mineralocorticoid receptor
(Homo sapiens (Human))
BDBM50201102
(1-(2-hydroxy-4-methyl-4-phenyl-2-(trifluoromethyl)...)
Show SMILES CC(C)(CC(O)(Cn1ccc(=O)c2ccccc12)C(F)(F)F)c1ccccc1
Show InChI InChI=1S/C22H22F3NO2/c1-20(2,16-8-4-3-5-9-16)14-21(28,22(23,24)25)15-26-13-12-19(27)17-10-6-7-11-18(17)26/h3-13,28H,14-15H2,1-2H3
n/an/a 350n/an/an/an/an/an/a
Boehringer Ingelheim Pharmaceuticals
Curated by ChEMBL
Assay Description
Inhibition of tetramethylrhodamine labeled dexamethosone binding to MR by FP assay
J Med Chem 49: 7887-96 (2006)
Article DOI: 10.1021/jm061273t
BindingDB Entry DOI: 10.7270/Q2BG2PTB