BDBM50201760 CHEMBL3905343
SMILES: COC(=O)c1cc2occc2n1CC(=O)c1cccc(Br)c1
InChI Key: InChIKey=FPDAZUGQAJLLCY-UHFFFAOYSA-N
Data: 1 IC50
Activity Spreadsheet -- Enzyme Inhibition Constant Data from BindingDB
Found 1 hit for monomerid = 50201760
Trg + Lig
Ki
nM
ΔG°
kcal/mole
IC50
nM
Kd
nM
EC50/IC50
nM
koff
s-1
kon
M-1s-1
pHTemp
°C
N-acetyltransferase Eis
(Mycobacterium tuberculosis (strain ATCC 25618 / H3...)
BDBM50201760
(CHEMBL3905343)
Show SMILES COC(=O)c1cc2occc2n1CC(=O)c1cccc(Br)c1
Show InChI InChI=1S/C16H12BrNO4/c1-21-16(20)13-8-15-12(5-6-22-15)18(13)9-14(19)10-3-2-4-11(17)7-10/h2-8H,9H2,1H3
n/an/a 500n/an/an/an/an/an/a
University of Kentucky
Curated by ChEMBL
Assay Description
Inhibition of Mycobacterium tuberculosis H37Rv Eis expressed in Escherichia coli BL21(DE3) using Acetyl-CoA as substrate preincubated for 10 mins fol...
ACS Med Chem Lett 7: 1219-1221 (2016)
Article DOI: 10.1021/acsmedchemlett.6b00261
BindingDB Entry DOI: 10.7270/Q2251M51