BDBM50201895 8-chloro-2-(4-chlorophenyl)-3-hydroxyquinoline-4-carboxylicacid::CHEMBL384543
SMILES: OC(=O)c1c(O)c(nc2c(Cl)cccc12)-c1ccc(Cl)cc1
InChI Key: InChIKey=CXLWGHIVYZAREC-UHFFFAOYSA-N
Data: 2 IC50
Activity Spreadsheet -- Enzyme Inhibition Constant Data from BindingDB
Found 2 hits for monomerid = 50201895
Trg + Lig
Ki
nM
ΔG°
kcal/mole
IC50
nM
Kd
nM
EC50/IC50
nM
koff
s-1
kon
M-1s-1
pHTemp
°C
P-selectin/P-selectin glycoprotein ligand 1
(Homo sapiens (Human))
BDBM50201895
(8-chloro-2-(4-chlorophenyl)-3-hydroxyquinoline-4-c...)
Show SMILES OC(=O)c1c(O)c(nc2c(Cl)cccc12)-c1ccc(Cl)cc1
Show InChI InChI=1S/C16H9Cl2NO3/c17-9-6-4-8(5-7-9)13-15(20)12(16(21)22)10-2-1-3-11(18)14(10)19-13/h1-7,20H,(H,21,22)
NCI pathway
Reactome pathway
n/an/a 6.00E+5n/an/an/an/an/an/a
Wyeth Research
Curated by ChEMBL
Assay Description
Inhibition of P-selectin-mediated adhesion of HL60 cells
J Med Chem 50: 21-39 (2007)
Article DOI: 10.1021/jm0602256
BindingDB Entry DOI: 10.7270/Q2Z60PVV
Dihydroorotate dehydrogenase
(Homo sapiens (Human))
BDBM50201895
(8-chloro-2-(4-chlorophenyl)-3-hydroxyquinoline-4-c...)
Show SMILES OC(=O)c1c(O)c(nc2c(Cl)cccc12)-c1ccc(Cl)cc1
Show InChI InChI=1S/C16H9Cl2NO3/c17-9-6-4-8(5-7-9)13-15(20)12(16(21)22)10-2-1-3-11(18)14(10)19-13/h1-7,20H,(H,21,22)
Reactome pathway
n/an/a 1.41E+5n/an/an/an/an/an/a
Wyeth Research
Curated by ChEMBL
Assay Description
Inhibition of human recombinant DHOD expressed in Escherichia coli
J Med Chem 50: 21-39 (2007)
Article DOI: 10.1021/jm0602256
BindingDB Entry DOI: 10.7270/Q2Z60PVV