BDBM50201900 6-bromo-2-(4-chlorophenyl)-3-hydroxyquinoline-4-carboxylicacid::CHEMBL218700
SMILES: OC(=O)c1c(O)c(nc2ccc(Br)cc12)-c1ccc(Cl)cc1
InChI Key: InChIKey=QBBWBKLCVRPOEI-UHFFFAOYSA-N
Data: 2 IC50
Activity Spreadsheet -- Enzyme Inhibition Constant Data from BindingDB
Found 2 hits for monomerid = 50201900
Trg + Lig
Ki
nM
ΔG°
kcal/mole
IC50
nM
Kd
nM
EC50/IC50
nM
koff
s-1
kon
M-1s-1
pHTemp
°C
Dihydroorotate dehydrogenase
(Homo sapiens (Human))
BDBM50201900
(6-bromo-2-(4-chlorophenyl)-3-hydroxyquinoline-4-ca...)
Show SMILES OC(=O)c1c(O)c(nc2ccc(Br)cc12)-c1ccc(Cl)cc1
Show InChI InChI=1S/C16H9BrClNO3/c17-9-3-6-12-11(7-9)13(16(21)22)15(20)14(19-12)8-1-4-10(18)5-2-8/h1-7,20H,(H,21,22)
Reactome pathway
n/an/a 211n/an/an/an/an/an/a
Wyeth Research
Curated by ChEMBL
Assay Description
Inhibition of human recombinant DHOD expressed in Escherichia coli
J Med Chem 50: 21-39 (2007)
Article DOI: 10.1021/jm0602256
BindingDB Entry DOI: 10.7270/Q2Z60PVV
P-selectin/P-selectin glycoprotein ligand 1
(Homo sapiens (Human))
BDBM50201900
(6-bromo-2-(4-chlorophenyl)-3-hydroxyquinoline-4-ca...)
Show SMILES OC(=O)c1c(O)c(nc2ccc(Br)cc12)-c1ccc(Cl)cc1
Show InChI InChI=1S/C16H9BrClNO3/c17-9-3-6-12-11(7-9)13(16(21)22)15(20)14(19-12)8-1-4-10(18)5-2-8/h1-7,20H,(H,21,22)
NCI pathway
Reactome pathway
n/an/a 1.00E+6n/an/an/an/an/an/a
Wyeth Research
Curated by ChEMBL
Assay Description
Inhibition of P-selectin-mediated adhesion of HL60 cells
J Med Chem 50: 21-39 (2007)
Article DOI: 10.1021/jm0602256
BindingDB Entry DOI: 10.7270/Q2Z60PVV