BDBM50201915 6-amino-2-(4-chlorophenyl)-3-hydroxyquinoline-4-carboxylicacid::CHEMBL217895
SMILES: Nc1ccc2nc(c(O)c(C(O)=O)c2c1)-c1ccc(Cl)cc1
InChI Key: InChIKey=BISGTMRLBWDHDM-UHFFFAOYSA-N
Data: 1 IC50
Activity Spreadsheet -- Enzyme Inhibition Constant Data from BindingDB
Found 1 hit for monomerid = 50201915
Trg + Lig
Ki
nM
ΔG°
kcal/mole
IC50
nM
Kd
nM
EC50/IC50
nM
koff
s-1
kon
M-1s-1
pHTemp
°C
P-selectin/P-selectin glycoprotein ligand 1
(Homo sapiens (Human))
BDBM50201915
(6-amino-2-(4-chlorophenyl)-3-hydroxyquinoline-4-ca...)
Show SMILES Nc1ccc2nc(c(O)c(C(O)=O)c2c1)-c1ccc(Cl)cc1
Show InChI InChI=1S/C16H11ClN2O3/c17-9-3-1-8(2-4-9)14-15(20)13(16(21)22)11-7-10(18)5-6-12(11)19-14/h1-7,20H,18H2,(H,21,22)
NCI pathway
Reactome pathway
n/an/a 3.00E+6n/an/an/an/an/an/a
Wyeth Research
Curated by ChEMBL
Assay Description
Inhibition of P-selectin-mediated adhesion of HL60 cells
J Med Chem 50: 21-39 (2007)
Article DOI: 10.1021/jm0602256
BindingDB Entry DOI: 10.7270/Q2Z60PVV