BDBM50201920 2-(4-chlorophenyl)-3-hydroxy-6,8-dimethylquinoline-4-carboxylicacid::CHEMBL375425
SMILES: Cc1cc(C)c2nc(c(O)c(C(O)=O)c2c1)-c1ccc(Cl)cc1
InChI Key: InChIKey=WYFYAZDPFHWPCD-UHFFFAOYSA-N
Data: 2 IC50
Activity Spreadsheet -- Enzyme Inhibition Constant Data from BindingDB
Found 2 hits for monomerid = 50201920
Trg + Lig
Ki
nM
ΔG°
kcal/mole
IC50
nM
Kd
nM
EC50/IC50
nM
koff
s-1
kon
M-1s-1
pHTemp
°C
Dihydroorotate dehydrogenase
(Homo sapiens (Human))
BDBM50201920
(2-(4-chlorophenyl)-3-hydroxy-6,8-dimethylquinoline...)
Show SMILES Cc1cc(C)c2nc(c(O)c(C(O)=O)c2c1)-c1ccc(Cl)cc1
Show InChI InChI=1S/C18H14ClNO3/c1-9-7-10(2)15-13(8-9)14(18(22)23)17(21)16(20-15)11-3-5-12(19)6-4-11/h3-8,21H,1-2H3,(H,22,23)
Reactome pathway
n/an/a 4.90E+3n/an/an/an/an/an/a
Wyeth Research
Curated by ChEMBL
Assay Description
Inhibition of human recombinant DHOD expressed in Escherichia coli
J Med Chem 50: 21-39 (2007)
Article DOI: 10.1021/jm0602256
BindingDB Entry DOI: 10.7270/Q2Z60PVV
P-selectin/P-selectin glycoprotein ligand 1
(Homo sapiens (Human))
BDBM50201920
(2-(4-chlorophenyl)-3-hydroxy-6,8-dimethylquinoline...)
Show SMILES Cc1cc(C)c2nc(c(O)c(C(O)=O)c2c1)-c1ccc(Cl)cc1
Show InChI InChI=1S/C18H14ClNO3/c1-9-7-10(2)15-13(8-9)14(18(22)23)17(21)16(20-15)11-3-5-12(19)6-4-11/h3-8,21H,1-2H3,(H,22,23)
NCI pathway
Reactome pathway
n/an/a 5.00E+5n/an/an/an/an/an/a
Wyeth Research
Curated by ChEMBL
Assay Description
Inhibition of P-selectin-mediated adhesion of HL60 cells
J Med Chem 50: 21-39 (2007)
Article DOI: 10.1021/jm0602256
BindingDB Entry DOI: 10.7270/Q2Z60PVV