null
SMILES: OC(=O)c1c(O)c(nc2c(cccc12)C(F)(F)F)-c1ccc(Cl)cc1
InChI Key: InChIKey=IFOJFPDDHMLNHD-UHFFFAOYSA-N
Activity Spreadsheet -- Enzyme Inhibition Constant Data from BindingDB
Found 2 hits for monomerid = 50201938
Trg + Lig
Ki
nM
ΔG°
kcal/mole
IC50
nM
Kd
nM
EC50/IC50
nM
koff
s-1
kon
M-1s-1
pHTemp
°C
P-selectin glycoprotein ligand 1
(Homo sapiens (Human))
BDBM50201938
(2-(4-chlorophenyl)-3-hydroxy-8-trifluoromethylquin...)
Show SMILES OC(=O)c1c(O)c(nc2c(cccc12)C(F)(F)F)-c1ccc(Cl)cc1
Show InChI InChI=1S/C17H9ClF3NO3/c18-9-6-4-8(5-7-9)13-15(23)12(16(24)25)10-2-1-3-11(14(10)22-13)17(19,20)21/h1-7,23H,(H,24,25)
NCI pathway
Reactome pathway
n/an/a 2.50E+5n/an/an/an/an/an/a
Wyeth Research
Curated by ChEMBL
Assay Description
Inhibition of P-selectin-mediated adhesion of HL60 cells
J Med Chem 50: 21-39 (2007)
Article DOI: 10.1021/jm0602256
BindingDB Entry DOI: 10.7270/Q2Z60PVV
Dihydroorotate dehydrogenase (quinone), mitochondrial
(Homo sapiens (Human))
BDBM50201938
(2-(4-chlorophenyl)-3-hydroxy-8-trifluoromethylquin...)
Show SMILES OC(=O)c1c(O)c(nc2c(cccc12)C(F)(F)F)-c1ccc(Cl)cc1
Show InChI InChI=1S/C17H9ClF3NO3/c18-9-6-4-8(5-7-9)13-15(23)12(16(24)25)10-2-1-3-11(14(10)22-13)17(19,20)21/h1-7,23H,(H,24,25)
Reactome pathway
n/an/a 1.36E+5n/an/an/an/an/an/a
Wyeth Research
Curated by ChEMBL
Assay Description
Inhibition of human recombinant DHOD expressed in Escherichia coli
J Med Chem 50: 21-39 (2007)
Article DOI: 10.1021/jm0602256
BindingDB Entry DOI: 10.7270/Q2Z60PVV