BDBM50202064 (3R,3aS,4S,4aR,8aR,9aR)-7,7-difluoro-decahydro-3-methyl-4-[(E)-2-[ 5-(3-fluorophenyl)-2-pyridinyl]ethenyl]naphtho[2,3-c]furan-1(3H)-one::CHEMBL219522
SMILES: C[C@H]1OC(=O)[C@@H]2C[C@@H]3CC(F)(F)CC[C@H]3[C@H](\C=C\c3ccc(cn3)-c3cccc(F)c3)[C@H]12
InChI Key: InChIKey=PXHHHMFTVFMECG-RRVPNGAVSA-N
Data: 1 IC50
Activity Spreadsheet -- Enzyme Inhibition Constant Data from BindingDB
Found 1 hit for monomerid = 50202064
Trg + Lig
Ki
nM
ΔG°
kcal/mole
IC50
nM
Kd
nM
EC50/IC50
nM
koff
s-1
kon
M-1s-1
pHTemp
°C
Proteinase-activated receptor 1
(Homo sapiens (Human))
BDBM50202064
((3R,3aS,4S,4aR,8aR,9aR)-7,7-difluoro-decahydro-3-m...)
Show SMILES C[C@H]1OC(=O)[C@@H]2C[C@@H]3CC(F)(F)CC[C@H]3[C@H](\C=C\c3ccc(cn3)-c3cccc(F)c3)[C@H]12 |r|
Show InChI InChI=1S/C26H26F3NO2/c1-15-24-22(21-9-10-26(28,29)13-18(21)12-23(24)25(31)32-15)8-7-20-6-5-17(14-30-20)16-3-2-4-19(27)11-16/h2-8,11,14-15,18,21-24H,9-10,12-13H2,1H3/b8-7+/t15-,18-,21-,22+,23-,24+/m1/s1
n/an/a 15n/an/an/an/an/an/a
Schering-Plough Research Institute
Curated by ChEMBL
Assay Description
Displacement of [3H]haTRAP from PAR1 in human platelet membrane
J Med Chem 50: 129-38 (2007)
Article DOI: 10.1021/jm061043e
BindingDB Entry DOI: 10.7270/Q22V2FS9