BDBM50202077 (3R,3aS,4S,4aR,8aR,9aR)-7,7-difluoro-decahydro-3-methyl-4-[(E)-2-[ 5-(3-methylphenyl)-2-pyridinyl] ethenyl]naphtho[2,3-c]furan-1(3H)-one::CHEMBL384982
SMILES: C[C@H]1OC(=O)[C@@H]2C[C@@H]3CC(F)(F)CC[C@H]3[C@H](\C=C\c3ccc(cn3)-c3cccc(C)c3)[C@H]12
InChI Key: InChIKey=HORIUOVNWTZAFL-IPEJPRIBSA-N
Data: 1 IC50
Activity Spreadsheet -- Enzyme Inhibition Constant Data from BindingDB
Found 1 hit for monomerid = 50202077
Trg + Lig
Ki
nM
ΔG°
kcal/mole
IC50
nM
Kd
nM
EC50/IC50
nM
koff
s-1
kon
M-1s-1
pHTemp
°C
Proteinase-activated receptor 1
(Homo sapiens (Human))
BDBM50202077
((3R,3aS,4S,4aR,8aR,9aR)-7,7-difluoro-decahydro-3-m...)
Show SMILES C[C@H]1OC(=O)[C@@H]2C[C@@H]3CC(F)(F)CC[C@H]3[C@H](\C=C\c3ccc(cn3)-c3cccc(C)c3)[C@H]12 |r|
Show InChI InChI=1S/C27H29F2NO2/c1-16-4-3-5-18(12-16)19-6-7-21(30-15-19)8-9-23-22-10-11-27(28,29)14-20(22)13-24-25(23)17(2)32-26(24)31/h3-9,12,15,17,20,22-25H,10-11,13-14H2,1-2H3/b9-8+/t17-,20-,22-,23+,24-,25+/m1/s1
n/an/a 80n/an/an/an/an/an/a
Schering-Plough Research Institute
Curated by ChEMBL
Assay Description
Displacement of [3H]haTRAP from PAR1 in human platelet membrane
J Med Chem 50: 129-38 (2007)
Article DOI: 10.1021/jm061043e
BindingDB Entry DOI: 10.7270/Q22V2FS9