BDBM50202115 CHEMBL217957::H-Tyr-D-Ala-Gly-Phe-NH-NH-D-Trp-Nle-Asp-Phe-Bo
SMILES: CCCC[C@H](NC(=O)[C@H](CC(O)=O)NC(=O)[C@H](Cc1ccccc1)NC(=O)OC(C)(C)C)C(=O)N[C@H](Cc1cc2ccccc2[nH]1)C(=O)NNC(=O)[C@H](Cc1ccccc1)NC(=O)CNC(=O)[C@@H](C)NC(=O)[C@@H](N)Cc1ccc(O)cc1
InChI Key: InChIKey=FEOAQCGOOODCEB-RXFVQNAMSA-N
Data: 7 KI  2 IC50  2 EC50
Activity Spreadsheet -- Enzyme Inhibition Constant Data from BindingDB
Found 11 hits for monomerid = 50202115
Trg + Lig
Ki
nM
ΔG°
kcal/mole
IC50
nM
Kd
nM
EC50/IC50
nM
koff
s-1
kon
M-1s-1
pHTemp
°C
Delta-type opioid receptor
(Homo sapiens (Human))
BDBM50202115
(CHEMBL217957 | H-Tyr-D-Ala-Gly-Phe-NH-NH-D-Trp-Nle...)
Show SMILES CCCC[C@H](NC(=O)[C@H](CC(O)=O)NC(=O)[C@H](Cc1ccccc1)NC(=O)OC(C)(C)C)C(=O)N[C@H](Cc1cc2ccccc2[nH]1)C(=O)NNC(=O)[C@H](Cc1ccccc1)NC(=O)CNC(=O)[C@@H](C)NC(=O)[C@@H](N)Cc1ccc(O)cc1 |r|
Show InChI InChI=1S/C58H73N11O13/c1-6-7-21-43(64-54(78)47(32-49(72)73)66-53(77)44(28-35-16-10-8-11-17-35)67-57(81)82-58(3,4)5)52(76)65-46(31-39-30-38-20-14-15-22-42(38)62-39)56(80)69-68-55(79)45(29-36-18-12-9-13-19-36)63-48(71)33-60-50(74)34(2)61-51(75)41(59)27-37-23-25-40(70)26-24-37/h8-20,22-26,30,34,41,43-47,62,70H,6-7,21,27-29,31-33,59H2,1-5H3,(H,60,74)(H,61,75)(H,63,71)(H,64,78)(H,65,76)(H,66,77)(H,67,81)(H,68,79)(H,69,80)(H,72,73)/t34-,41+,43+,44+,45+,46-,47+/m1/s1
Reactome pathway
0.630n/an/an/an/an/an/an/an/a
University of Arizona
Curated by ChEMBL
Assay Description
Displacement of [3H]DPDPE from human delta opioid receptor expressed in HN9.10 cells
J Med Chem 50: 165-8 (2007)
Article DOI: 10.1021/jm061268p
BindingDB Entry DOI: 10.7270/Q2TD9X17
Mu-type opioid receptor
(Rattus norvegicus (rat))
BDBM50202115
(CHEMBL217957 | H-Tyr-D-Ala-Gly-Phe-NH-NH-D-Trp-Nle...)
Show SMILES CCCC[C@H](NC(=O)[C@H](CC(O)=O)NC(=O)[C@H](Cc1ccccc1)NC(=O)OC(C)(C)C)C(=O)N[C@H](Cc1cc2ccccc2[nH]1)C(=O)NNC(=O)[C@H](Cc1ccccc1)NC(=O)CNC(=O)[C@@H](C)NC(=O)[C@@H](N)Cc1ccc(O)cc1 |r|
Show InChI InChI=1S/C58H73N11O13/c1-6-7-21-43(64-54(78)47(32-49(72)73)66-53(77)44(28-35-16-10-8-11-17-35)67-57(81)82-58(3,4)5)52(76)65-46(31-39-30-38-20-14-15-22-42(38)62-39)56(80)69-68-55(79)45(29-36-18-12-9-13-19-36)63-48(71)33-60-50(74)34(2)61-51(75)41(59)27-37-23-25-40(70)26-24-37/h8-20,22-26,30,34,41,43-47,62,70H,6-7,21,27-29,31-33,59H2,1-5H3,(H,60,74)(H,61,75)(H,63,71)(H,64,78)(H,65,76)(H,66,77)(H,67,81)(H,68,79)(H,69,80)(H,72,73)/t34-,41+,43+,44+,45+,46-,47+/m1/s1
Reactome pathway
52n/an/an/an/an/an/an/an/a
University of Arizona
Curated by ChEMBL
Assay Description
Activity at rat mu opioid receptor expressed in CHO cells by [35S]GTPgammaS binding assay
J Med Chem 50: 165-8 (2007)
Article DOI: 10.1021/jm061268p
BindingDB Entry DOI: 10.7270/Q2TD9X17
Mu-type opioid receptor
(Rattus norvegicus (rat))
BDBM50202115
(CHEMBL217957 | H-Tyr-D-Ala-Gly-Phe-NH-NH-D-Trp-Nle...)
Show SMILES CCCC[C@H](NC(=O)[C@H](CC(O)=O)NC(=O)[C@H](Cc1ccccc1)NC(=O)OC(C)(C)C)C(=O)N[C@H](Cc1cc2ccccc2[nH]1)C(=O)NNC(=O)[C@H](Cc1ccccc1)NC(=O)CNC(=O)[C@@H](C)NC(=O)[C@@H](N)Cc1ccc(O)cc1 |r|
Show InChI InChI=1S/C58H73N11O13/c1-6-7-21-43(64-54(78)47(32-49(72)73)66-53(77)44(28-35-16-10-8-11-17-35)67-57(81)82-58(3,4)5)52(76)65-46(31-39-30-38-20-14-15-22-42(38)62-39)56(80)69-68-55(79)45(29-36-18-12-9-13-19-36)63-48(71)33-60-50(74)34(2)61-51(75)41(59)27-37-23-25-40(70)26-24-37/h8-20,22-26,30,34,41,43-47,62,70H,6-7,21,27-29,31-33,59H2,1-5H3,(H,60,74)(H,61,75)(H,63,71)(H,64,78)(H,65,76)(H,66,77)(H,67,81)(H,68,79)(H,69,80)(H,72,73)/t34-,41+,43+,44+,45+,46-,47+/m1/s1
Reactome pathway
52n/an/an/an/an/an/an/an/a
University of Arizona
Curated by ChEMBL
Assay Description
Displacement of [3H]DAMGO from rat mu opioid receptor expressed in HN9.10 cells
J Med Chem 50: 165-8 (2007)
Article DOI: 10.1021/jm061268p
BindingDB Entry DOI: 10.7270/Q2TD9X17
Cholecystokinin receptor
(Homo sapiens (Human))
BDBM50202115
(CHEMBL217957 | H-Tyr-D-Ala-Gly-Phe-NH-NH-D-Trp-Nle...)
Show SMILES CCCC[C@H](NC(=O)[C@H](CC(O)=O)NC(=O)[C@H](Cc1ccccc1)NC(=O)OC(C)(C)C)C(=O)N[C@H](Cc1cc2ccccc2[nH]1)C(=O)NNC(=O)[C@H](Cc1ccccc1)NC(=O)CNC(=O)[C@@H](C)NC(=O)[C@@H](N)Cc1ccc(O)cc1 |r|
Show InChI InChI=1S/C58H73N11O13/c1-6-7-21-43(64-54(78)47(32-49(72)73)66-53(77)44(28-35-16-10-8-11-17-35)67-57(81)82-58(3,4)5)52(76)65-46(31-39-30-38-20-14-15-22-42(38)62-39)56(80)69-68-55(79)45(29-36-18-12-9-13-19-36)63-48(71)33-60-50(74)34(2)61-51(75)41(59)27-37-23-25-40(70)26-24-37/h8-20,22-26,30,34,41,43-47,62,70H,6-7,21,27-29,31-33,59H2,1-5H3,(H,60,74)(H,61,75)(H,63,71)(H,64,78)(H,65,76)(H,66,77)(H,67,81)(H,68,79)(H,69,80)(H,72,73)/t34-,41+,43+,44+,45+,46-,47+/m1/s1
Reactome pathway
71n/an/an/an/an/an/an/an/a
University of Arizona
Curated by ChEMBL
Assay Description
Displacement of [125I]CCK8-SO3 from human CCK2 receptor expressed in HEK293 cells
J Med Chem 50: 165-8 (2007)
Article DOI: 10.1021/jm061268p
BindingDB Entry DOI: 10.7270/Q2TD9X17
Cholecystokinin receptor
(Homo sapiens (Human))
BDBM50202115
(CHEMBL217957 | H-Tyr-D-Ala-Gly-Phe-NH-NH-D-Trp-Nle...)
Show SMILES CCCC[C@H](NC(=O)[C@H](CC(O)=O)NC(=O)[C@H](Cc1ccccc1)NC(=O)OC(C)(C)C)C(=O)N[C@H](Cc1cc2ccccc2[nH]1)C(=O)NNC(=O)[C@H](Cc1ccccc1)NC(=O)CNC(=O)[C@@H](C)NC(=O)[C@@H](N)Cc1ccc(O)cc1 |r|
Show InChI InChI=1S/C58H73N11O13/c1-6-7-21-43(64-54(78)47(32-49(72)73)66-53(77)44(28-35-16-10-8-11-17-35)67-57(81)82-58(3,4)5)52(76)65-46(31-39-30-38-20-14-15-22-42(38)62-39)56(80)69-68-55(79)45(29-36-18-12-9-13-19-36)63-48(71)33-60-50(74)34(2)61-51(75)41(59)27-37-23-25-40(70)26-24-37/h8-20,22-26,30,34,41,43-47,62,70H,6-7,21,27-29,31-33,59H2,1-5H3,(H,60,74)(H,61,75)(H,63,71)(H,64,78)(H,65,76)(H,66,77)(H,67,81)(H,68,79)(H,69,80)(H,72,73)/t34-,41+,43+,44+,45+,46-,47+/m1/s1
Reactome pathway
71n/an/an/an/an/an/an/an/a
University of Arizona
Curated by ChEMBL
Assay Description
Displacement of [125I]CCK8-SO3 from human CCK2 receptor expressed in HEK293 cells
J Med Chem 50: 165-8 (2007)
Article DOI: 10.1021/jm061268p
BindingDB Entry DOI: 10.7270/Q2TD9X17
Cholecystokinin receptor
(Homo sapiens (Human))
BDBM50202115
(CHEMBL217957 | H-Tyr-D-Ala-Gly-Phe-NH-NH-D-Trp-Nle...)
Show SMILES CCCC[C@H](NC(=O)[C@H](CC(O)=O)NC(=O)[C@H](Cc1ccccc1)NC(=O)OC(C)(C)C)C(=O)N[C@H](Cc1cc2ccccc2[nH]1)C(=O)NNC(=O)[C@H](Cc1ccccc1)NC(=O)CNC(=O)[C@@H](C)NC(=O)[C@@H](N)Cc1ccc(O)cc1 |r|
Show InChI InChI=1S/C58H73N11O13/c1-6-7-21-43(64-54(78)47(32-49(72)73)66-53(77)44(28-35-16-10-8-11-17-35)67-57(81)82-58(3,4)5)52(76)65-46(31-39-30-38-20-14-15-22-42(38)62-39)56(80)69-68-55(79)45(29-36-18-12-9-13-19-36)63-48(71)33-60-50(74)34(2)61-51(75)41(59)27-37-23-25-40(70)26-24-37/h8-20,22-26,30,34,41,43-47,62,70H,6-7,21,27-29,31-33,59H2,1-5H3,(H,60,74)(H,61,75)(H,63,71)(H,64,78)(H,65,76)(H,66,77)(H,67,81)(H,68,79)(H,69,80)(H,72,73)/t34-,41+,43+,44+,45+,46-,47+/m1/s1
Reactome pathway
>1.00E+4n/an/an/an/an/an/an/an/a
University of Arizona
Curated by ChEMBL
Assay Description
Displacement of [125I]CCK8-SO3 from human CCK1 receptor expressed in HEK293 cells
J Med Chem 50: 165-8 (2007)
Article DOI: 10.1021/jm061268p
BindingDB Entry DOI: 10.7270/Q2TD9X17
Cholecystokinin receptor
(Homo sapiens (Human))
BDBM50202115
(CHEMBL217957 | H-Tyr-D-Ala-Gly-Phe-NH-NH-D-Trp-Nle...)
Show SMILES CCCC[C@H](NC(=O)[C@H](CC(O)=O)NC(=O)[C@H](Cc1ccccc1)NC(=O)OC(C)(C)C)C(=O)N[C@H](Cc1cc2ccccc2[nH]1)C(=O)NNC(=O)[C@H](Cc1ccccc1)NC(=O)CNC(=O)[C@@H](C)NC(=O)[C@@H](N)Cc1ccc(O)cc1 |r|
Show InChI InChI=1S/C58H73N11O13/c1-6-7-21-43(64-54(78)47(32-49(72)73)66-53(77)44(28-35-16-10-8-11-17-35)67-57(81)82-58(3,4)5)52(76)65-46(31-39-30-38-20-14-15-22-42(38)62-39)56(80)69-68-55(79)45(29-36-18-12-9-13-19-36)63-48(71)33-60-50(74)34(2)61-51(75)41(59)27-37-23-25-40(70)26-24-37/h8-20,22-26,30,34,41,43-47,62,70H,6-7,21,27-29,31-33,59H2,1-5H3,(H,60,74)(H,61,75)(H,63,71)(H,64,78)(H,65,76)(H,66,77)(H,67,81)(H,68,79)(H,69,80)(H,72,73)/t34-,41+,43+,44+,45+,46-,47+/m1/s1
Reactome pathway
>1.00E+4n/an/an/an/an/an/an/an/a
University of Arizona
Curated by ChEMBL
Assay Description
Displacement of [125I]CCK8-SO3 from human CCK1 receptor expressed in HEK293 cells
J Med Chem 50: 165-8 (2007)
Article DOI: 10.1021/jm061268p
BindingDB Entry DOI: 10.7270/Q2TD9X17
Delta-type opioid receptor
(MOUSE)
BDBM50202115
(CHEMBL217957 | H-Tyr-D-Ala-Gly-Phe-NH-NH-D-Trp-Nle...)
Show SMILES CCCC[C@H](NC(=O)[C@H](CC(O)=O)NC(=O)[C@H](Cc1ccccc1)NC(=O)OC(C)(C)C)C(=O)N[C@H](Cc1cc2ccccc2[nH]1)C(=O)NNC(=O)[C@H](Cc1ccccc1)NC(=O)CNC(=O)[C@@H](C)NC(=O)[C@@H](N)Cc1ccc(O)cc1 |r|
Show InChI InChI=1S/C58H73N11O13/c1-6-7-21-43(64-54(78)47(32-49(72)73)66-53(77)44(28-35-16-10-8-11-17-35)67-57(81)82-58(3,4)5)52(76)65-46(31-39-30-38-20-14-15-22-42(38)62-39)56(80)69-68-55(79)45(29-36-18-12-9-13-19-36)63-48(71)33-60-50(74)34(2)61-51(75)41(59)27-37-23-25-40(70)26-24-37/h8-20,22-26,30,34,41,43-47,62,70H,6-7,21,27-29,31-33,59H2,1-5H3,(H,60,74)(H,61,75)(H,63,71)(H,64,78)(H,65,76)(H,66,77)(H,67,81)(H,68,79)(H,69,80)(H,72,73)/t34-,41+,43+,44+,45+,46-,47+/m1/s1
Reactome pathway
n/an/a 16n/an/an/an/an/an/a
University of Arizona
Curated by ChEMBL
Assay Description
Activity at delta opioid receptor in ICR mouse by MVD assay
J Med Chem 50: 165-8 (2007)
Article DOI: 10.1021/jm061268p
BindingDB Entry DOI: 10.7270/Q2TD9X17
Mu-type opioid receptor
(GUINEA PIG)
BDBM50202115
(CHEMBL217957 | H-Tyr-D-Ala-Gly-Phe-NH-NH-D-Trp-Nle...)
Show SMILES CCCC[C@H](NC(=O)[C@H](CC(O)=O)NC(=O)[C@H](Cc1ccccc1)NC(=O)OC(C)(C)C)C(=O)N[C@H](Cc1cc2ccccc2[nH]1)C(=O)NNC(=O)[C@H](Cc1ccccc1)NC(=O)CNC(=O)[C@@H](C)NC(=O)[C@@H](N)Cc1ccc(O)cc1 |r|
Show InChI InChI=1S/C58H73N11O13/c1-6-7-21-43(64-54(78)47(32-49(72)73)66-53(77)44(28-35-16-10-8-11-17-35)67-57(81)82-58(3,4)5)52(76)65-46(31-39-30-38-20-14-15-22-42(38)62-39)56(80)69-68-55(79)45(29-36-18-12-9-13-19-36)63-48(71)33-60-50(74)34(2)61-51(75)41(59)27-37-23-25-40(70)26-24-37/h8-20,22-26,30,34,41,43-47,62,70H,6-7,21,27-29,31-33,59H2,1-5H3,(H,60,74)(H,61,75)(H,63,71)(H,64,78)(H,65,76)(H,66,77)(H,67,81)(H,68,79)(H,69,80)(H,72,73)/t34-,41+,43+,44+,45+,46-,47+/m1/s1
n/an/a 240n/an/an/an/an/an/a
University of Arizona
Curated by ChEMBL
Assay Description
Activity at mu opioid receptor assessed as contraction of electrically-stimulated Hartley guinea pig ileum
J Med Chem 50: 165-8 (2007)
Article DOI: 10.1021/jm061268p
BindingDB Entry DOI: 10.7270/Q2TD9X17
Delta-type opioid receptor
(Homo sapiens (Human))
BDBM50202115
(CHEMBL217957 | H-Tyr-D-Ala-Gly-Phe-NH-NH-D-Trp-Nle...)
Show SMILES CCCC[C@H](NC(=O)[C@H](CC(O)=O)NC(=O)[C@H](Cc1ccccc1)NC(=O)OC(C)(C)C)C(=O)N[C@H](Cc1cc2ccccc2[nH]1)C(=O)NNC(=O)[C@H](Cc1ccccc1)NC(=O)CNC(=O)[C@@H](C)NC(=O)[C@@H](N)Cc1ccc(O)cc1 |r|
Show InChI InChI=1S/C58H73N11O13/c1-6-7-21-43(64-54(78)47(32-49(72)73)66-53(77)44(28-35-16-10-8-11-17-35)67-57(81)82-58(3,4)5)52(76)65-46(31-39-30-38-20-14-15-22-42(38)62-39)56(80)69-68-55(79)45(29-36-18-12-9-13-19-36)63-48(71)33-60-50(74)34(2)61-51(75)41(59)27-37-23-25-40(70)26-24-37/h8-20,22-26,30,34,41,43-47,62,70H,6-7,21,27-29,31-33,59H2,1-5H3,(H,60,74)(H,61,75)(H,63,71)(H,64,78)(H,65,76)(H,66,77)(H,67,81)(H,68,79)(H,69,80)(H,72,73)/t34-,41+,43+,44+,45+,46-,47+/m1/s1
Reactome pathway
n/an/an/an/a 5.90n/an/an/an/a
University of Arizona
Curated by ChEMBL
Assay Description
Activity at human delta opioid receptor expressed in CHO cells by [35S]GTPgammaS binding assay
J Med Chem 50: 165-8 (2007)
Article DOI: 10.1021/jm061268p
BindingDB Entry DOI: 10.7270/Q2TD9X17
Mu-type opioid receptor
(Rattus norvegicus (rat))
BDBM50202115
(CHEMBL217957 | H-Tyr-D-Ala-Gly-Phe-NH-NH-D-Trp-Nle...)
Show SMILES CCCC[C@H](NC(=O)[C@H](CC(O)=O)NC(=O)[C@H](Cc1ccccc1)NC(=O)OC(C)(C)C)C(=O)N[C@H](Cc1cc2ccccc2[nH]1)C(=O)NNC(=O)[C@H](Cc1ccccc1)NC(=O)CNC(=O)[C@@H](C)NC(=O)[C@@H](N)Cc1ccc(O)cc1 |r|
Show InChI InChI=1S/C58H73N11O13/c1-6-7-21-43(64-54(78)47(32-49(72)73)66-53(77)44(28-35-16-10-8-11-17-35)67-57(81)82-58(3,4)5)52(76)65-46(31-39-30-38-20-14-15-22-42(38)62-39)56(80)69-68-55(79)45(29-36-18-12-9-13-19-36)63-48(71)33-60-50(74)34(2)61-51(75)41(59)27-37-23-25-40(70)26-24-37/h8-20,22-26,30,34,41,43-47,62,70H,6-7,21,27-29,31-33,59H2,1-5H3,(H,60,74)(H,61,75)(H,63,71)(H,64,78)(H,65,76)(H,66,77)(H,67,81)(H,68,79)(H,69,80)(H,72,73)/t34-,41+,43+,44+,45+,46-,47+/m1/s1
Reactome pathway
n/an/an/an/a 630n/an/an/an/a
University of Arizona
Curated by ChEMBL
Assay Description
Activity at rat mu opioid receptor expressed in CHO cells by [35S]GTPgammaS binding assay
J Med Chem 50: 165-8 (2007)
Article DOI: 10.1021/jm061268p
BindingDB Entry DOI: 10.7270/Q2TD9X17