BDBM50202219 5-hydroxybenzo[b]furan-2-yl-(5-hydroxy-1Hindol-2-yl)methanone::CHEMBL226184
SMILES: Oc1ccc2[nH]c(cc2c1)C(=O)c1cc2cc(O)ccc2o1
InChI Key: InChIKey=ZKIUEEGLQKCTHN-UHFFFAOYSA-N
Data: 2 IC50
Activity Spreadsheet -- Enzyme Inhibition Constant Data from BindingDB
Found 2 hits for monomerid = 50202219
Trg + Lig
Ki
nM
ΔG°
kcal/mole
IC50
nM
Kd
nM
EC50/IC50
nM
koff
s-1
kon
M-1s-1
pHTemp
°C
Receptor-type tyrosine-protein kinase FLT3
(Homo sapiens (Human))
BDBM50202219
(5-hydroxybenzo[b]furan-2-yl-(5-hydroxy-1Hindol-2-y...)
Show SMILES Oc1ccc2[nH]c(cc2c1)C(=O)c1cc2cc(O)ccc2o1
Show InChI InChI=1S/C17H11NO4/c19-11-1-3-13-9(5-11)7-14(18-13)17(21)16-8-10-6-12(20)2-4-15(10)22-16/h1-8,18-20H
n/an/a 270n/an/an/an/an/an/a
University of Regensburg
Curated by ChEMBL
Assay Description
Inhibition of endogenous FLT3 autophosphorylation in EOL1 cells
Bioorg Med Chem 15: 2187-97 (2007)
Article DOI: 10.1016/j.bmc.2006.12.011
BindingDB Entry DOI: 10.7270/Q2F47NT9
Platelet-derived growth factor receptor beta
(Mus musculus (mouse))
BDBM50202219
(5-hydroxybenzo[b]furan-2-yl-(5-hydroxy-1Hindol-2-y...)
Show SMILES Oc1ccc2[nH]c(cc2c1)C(=O)c1cc2cc(O)ccc2o1
Show InChI InChI=1S/C17H11NO4/c19-11-1-3-13-9(5-11)7-14(18-13)17(21)16-8-10-6-12(20)2-4-15(10)22-16/h1-8,18-20H
n/an/a 200n/an/an/an/an/an/a
University of Regensburg
Curated by ChEMBL
Assay Description
Inhibition of endogenous PDGFRbeta autophosphorylation in Swiss 3T3 fibroblasts
Bioorg Med Chem 15: 2187-97 (2007)
Article DOI: 10.1016/j.bmc.2006.12.011
BindingDB Entry DOI: 10.7270/Q2F47NT9