BDBM50202345 CHEMBL373636::cyclo(-D-Tyr-D-Arg-L-Arg-L-Nal-D-Ala-)
SMILES: [#6]-[#6@H]-1-[#7]-[#6](=O)-[#6@@H](-[#6]-c2ccc(-[#8])cc2)-[#7]-[#6](=O)-[#6@@H](-[#6]-[#6]-[#6]\[#7]=[#6](\[#7])-[#7])-[#7]-[#6](=O)-[#6@H](-[#6]-[#6]-[#6]\[#7]=[#6](\[#7])-[#7])-[#7]-[#6](=O)-[#6@H](-[#6]-c2ccc3ccccc3c2)-[#7]-[#6]-1=O
InChI Key: InChIKey=VWZBFEAQYFTPKH-UIMYGGOYSA-N
Data: 1 IC50
Activity Spreadsheet -- Enzyme Inhibition Constant Data from BindingDB
Found 1 hit for monomerid = 50202345
Trg + Lig
Ki
nM
ΔG°
kcal/mole
IC50
nM
Kd
nM
EC50/IC50
nM
koff
s-1
kon
M-1s-1
pHTemp
°C
C-X-C chemokine receptor type 4 (CXCR4)
(Homo sapiens (Human))
BDBM50202345
(CHEMBL373636 | cyclo(-D-Tyr-D-Arg-L-Arg-L-Nal-D-Al...)
Show SMILES [#6]-[#6@H]-1-[#7]-[#6](=O)-[#6@@H](-[#6]-c2ccc(-[#8])cc2)-[#7]-[#6](=O)-[#6@@H](-[#6]-[#6]-[#6]\[#7]=[#6](\[#7])-[#7])-[#7]-[#6](=O)-[#6@H](-[#6]-[#6]-[#6]\[#7]=[#6](\[#7])-[#7])-[#7]-[#6](=O)-[#6@H](-[#6]-c2ccc3ccccc3c2)-[#7]-[#6]-1=O |r|
Show InChI InChI=1S/C37H49N11O6/c1-21-31(50)47-30(20-23-10-13-24-6-2-3-7-25(24)18-23)35(54)46-27(8-4-16-42-36(38)39)32(51)45-28(9-5-17-43-37(40)41)33(52)48-29(34(53)44-21)19-22-11-14-26(49)15-12-22/h2-3,6-7,10-15,18,21,27-30,49H,4-5,8-9,16-17,19-20H2,1H3,(H,44,53)(H,45,51)(H,46,54)(H,47,50)(H,48,52)(H4,38,39,42)(H4,40,41,43)/t21-,27+,28-,29-,30+/m1/s1
n/an/a 11n/an/an/an/an/an/a
Kyoto University
Curated by ChEMBL
Assay Description
Inhibition of [125I]SDF1 binding to CXCR4 transfected in CHO cells
J Med Chem 50: 192-8 (2007)
Article DOI: 10.1021/jm0607350
BindingDB Entry DOI: 10.7270/Q25M65D3