BDBM50202443 CHEMBL3928271
SMILES: Oc1cc2O\C(=C/c3cn(CC4CCCCC4)c4ccc(Br)cc34)C(=O)c2c(O)c1
InChI Key: InChIKey=OLPWWAZBULMGSC-UYOCIXKTSA-N
Data: 1 IC50
Activity Spreadsheet -- Enzyme Inhibition Constant Data from BindingDB
Found 1 hit for monomerid = 50202443
Trg + Lig
Ki
nM
ΔG°
kcal/mole
IC50
nM
Kd
nM
EC50/IC50
nM
koff
s-1
kon
M-1s-1
pHTemp
°C
Multidrug resistance-associated protein 2 (MRP2)
(Homo sapiens (Human))
BDBM50202443
(CHEMBL3928271)
Show SMILES Oc1cc2O\C(=C/c3cn(CC4CCCCC4)c4ccc(Br)cc34)C(=O)c2c(O)c1
Show InChI InChI=1S/C24H22BrNO4/c25-16-6-7-19-18(9-16)15(13-26(19)12-14-4-2-1-3-5-14)8-22-24(29)23-20(28)10-17(27)11-21(23)30-22/h6-11,13-14,27-28H,1-5,12H2/b22-8-
n/an/a 1.58E+4n/an/an/an/an/an/a
BMSSI UMR 5086 CNRS/Universit£ Lyon 1
Curated by ChEMBL
Assay Description
Inhibition of ABCC2 (unknown origin) expressed in MDCK2 cells assessed as inhibition of calcein-AM efflux measured after 30 mins in presence of ABCB1...
Eur J Med Chem 122: 408-418 (2016)
Article DOI: 10.1016/j.ejmech.2016.06.039
BindingDB Entry DOI: 10.7270/Q2RN39TM