BDBM50202445 CHEMBL3921707
SMILES: Cn1cc(\C=C2/Oc3cc(O)cc(O)c3C2=O)c2cc(Br)ccc12
InChI Key: InChIKey=PDOGVBARESRHII-XRVIQIRUSA-N
Data: 1 IC50
Activity Spreadsheet -- Enzyme Inhibition Constant Data from BindingDB
Found 1 hit for monomerid = 50202445
Trg + Lig
Ki
nM
ΔG°
kcal/mole
IC50
nM
Kd
nM
EC50/IC50
nM
koff
s-1
kon
M-1s-1
pHTemp
°C
Multidrug resistance-associated protein 2 (MRP2)
(Homo sapiens (Human))
BDBM50202445
(CHEMBL3921707)
Show SMILES Cn1cc(\C=C2/Oc3cc(O)cc(O)c3C2=O)c2cc(Br)ccc12
Show InChI InChI=1S/C18H12BrNO4/c1-20-8-9(12-5-10(19)2-3-13(12)20)4-16-18(23)17-14(22)6-11(21)7-15(17)24-16/h2-8,21-22H,1H3/b16-4-
n/an/a 4.50E+3n/an/an/an/an/an/a
BMSSI UMR 5086 CNRS/Universit£ Lyon 1
Curated by ChEMBL
Assay Description
Inhibition of ABCC2 (unknown origin) expressed in MDCK2 cells assessed as inhibition of calcein-AM efflux measured after 30 mins in presence of ABCB1...
Eur J Med Chem 122: 408-418 (2016)
Article DOI: 10.1016/j.ejmech.2016.06.039
BindingDB Entry DOI: 10.7270/Q2RN39TM