BDBM50202446 CHEMBL3964042
SMILES: COc1ccc2n(Cc3cccc(Br)c3)cc(\C=C3/Oc4cc(O)cc(O)c4C3=O)c2c1
InChI Key: InChIKey=SIMSFCJSWMVLNH-NYAPKIOYSA-N
Data: 1 IC50
Activity Spreadsheet -- Enzyme Inhibition Constant Data from BindingDB
Found 1 hit for monomerid = 50202446
Trg + Lig
Ki
nM
ΔG°
kcal/mole
IC50
nM
Kd
nM
EC50/IC50
nM
koff
s-1
kon
M-1s-1
pHTemp
°C
Multidrug resistance-associated protein 2 (MRP2)
(Homo sapiens (Human))
BDBM50202446
(CHEMBL3964042)
Show SMILES COc1ccc2n(Cc3cccc(Br)c3)cc(\C=C3/Oc4cc(O)cc(O)c4C3=O)c2c1
Show InChI InChI=1S/C25H18BrNO5/c1-31-18-5-6-20-19(11-18)15(13-27(20)12-14-3-2-4-16(26)7-14)8-23-25(30)24-21(29)9-17(28)10-22(24)32-23/h2-11,13,28-29H,12H2,1H3/b23-8-
n/an/a 7.30E+3n/an/an/an/an/an/a
BMSSI UMR 5086 CNRS/Universit£ Lyon 1
Curated by ChEMBL
Assay Description
Inhibition of ABCC2 (unknown origin) expressed in MDCK2 cells assessed as inhibition of calcein-AM efflux measured after 30 mins in presence of ABCB1...
Eur J Med Chem 122: 408-418 (2016)
Article DOI: 10.1016/j.ejmech.2016.06.039
BindingDB Entry DOI: 10.7270/Q2RN39TM