null
SMILES: Cn1c2cc(CN3CCC(CC3)NC(=O)c3cc(=O)c4ccc(F)cc4o3)ccc2ccc1=O
InChI Key: InChIKey=ZWAQGKCYZQHRHG-UHFFFAOYSA-N
Activity Spreadsheet -- Enzyme Inhibition Constant Data from BindingDB
Found 2 hits for monomerid = 50202682
Trg + Lig
Ki
nM
ΔG°
kcal/mole
IC50
nM
Kd
nM
EC50/IC50
nM
koff
s-1
kon
M-1s-1
pHTemp
°C
Melanin-concentrating hormone receptor 1
(Homo sapiens (Human))
BDBM50202682
(7-fluoro-N-(1-((1-methyl-2-oxo-1,2-dihydroquinolin...)
Show SMILES Cn1c2cc(CN3CCC(CC3)NC(=O)c3cc(=O)c4ccc(F)cc4o3)ccc2ccc1=O
Show InChI InChI=1S/C26H24FN3O4/c1-29-21-12-16(2-3-17(21)4-7-25(29)32)15-30-10-8-19(9-11-30)28-26(33)24-14-22(31)20-6-5-18(27)13-23(20)34-24/h2-7,12-14,19H,8-11,15H2,1H3,(H,28,33)
Reactome pathway
n/an/a 3n/an/an/an/an/an/a
Abbott Laboratories
Curated by ChEMBL
Assay Description
Displacement of 125I-MCH from MCH-R1 expressed in IMR-32 cells
Bioorg Med Chem Lett 17: 874-8 (2007)
Article DOI: 10.1016/j.bmcl.2006.11.065
BindingDB Entry DOI: 10.7270/Q2D50MMK
Potassium voltage-gated channel subfamily H member 2
(Homo sapiens (Human))
BDBM50202682
(7-fluoro-N-(1-((1-methyl-2-oxo-1,2-dihydroquinolin...)
Show SMILES Cn1c2cc(CN3CCC(CC3)NC(=O)c3cc(=O)c4ccc(F)cc4o3)ccc2ccc1=O
Show InChI InChI=1S/C26H24FN3O4/c1-29-21-12-16(2-3-17(21)4-7-25(29)32)15-30-10-8-19(9-11-30)28-26(33)24-14-22(31)20-6-5-18(27)13-23(20)34-24/h2-7,12-14,19H,8-11,15H2,1H3,(H,28,33)
Reactome pathway
n/an/a 4.74E+4n/an/an/an/an/an/a
Abbott Laboratories
Curated by ChEMBL
Assay Description
Displacement of 3H-dofetilide from hERG-expressing HEK membrane homogenates
Bioorg Med Chem Lett 17: 874-8 (2007)
Article DOI: 10.1016/j.bmcl.2006.11.065
BindingDB Entry DOI: 10.7270/Q2D50MMK