BDBM50202737 CHEMBL395665::N-(4-(4-amino-7-(3-((1r,4r)-4-aminocyclohexylamino)prop-1-enyl)thieno[3,2-c]pyridin-3-yl)-2-methoxyphenyl)-1-methyl-1H-indole-2-carboxamide
SMILES: COc1cc(ccc1NC(=O)c1cc2ccccc2n1C)-c1csc2c(\C=C\CN[C@H]3CC[C@H](N)CC3)cnc(N)c12
InChI Key: InChIKey=FRQGIFZNGIECRT-LSKJDRFGSA-N
Data: 8 IC50
Activity Spreadsheet -- Enzyme Inhibition Constant Data from BindingDB
Found 8 hits for monomerid = 50202737
Trg + Lig
Ki
nM
ΔG°
kcal/mole
IC50
nM
Kd
nM
EC50/IC50
nM
koff
s-1
kon
M-1s-1
pHTemp
°C
Proto-oncogene tyrosine-protein kinase Src
(Homo sapiens (Human))
BDBM50202737
(CHEMBL395665 | N-(4-(4-amino-7-(3-((1r,4r)-4-amino...)
Show SMILES COc1cc(ccc1NC(=O)c1cc2ccccc2n1C)-c1csc2c(\C=C\CN[C@H]3CC[C@H](N)CC3)cnc(N)c12 |wU:30.32,wD:33.36,(5.61,-23.77,;4.15,-23.29,;3.01,-24.32,;1.54,-23.84,;.4,-24.87,;.73,-26.38,;2.18,-26.85,;3.33,-25.82,;4.78,-26.3,;5.1,-27.8,;3.96,-28.84,;6.57,-28.28,;7.04,-29.76,;8.59,-29.75,;9.62,-30.9,;11.13,-30.57,;11.61,-29.11,;10.57,-27.96,;9.07,-28.28,;7.83,-27.37,;7.83,-25.83,;-1.07,-24.39,;-2.31,-25.31,;-3.56,-24.4,;-3.08,-22.94,;-3.85,-21.62,;-5.39,-21.62,;-6.16,-20.29,;-7.7,-20.3,;-8.47,-18.96,;-7.71,-17.63,;-8.47,-16.3,;-7.7,-14.97,;-6.16,-14.97,;-5.39,-13.64,;-5.4,-16.3,;-6.16,-17.63,;-3.09,-20.3,;-1.55,-20.29,;-.79,-21.62,;.75,-21.62,;-1.55,-22.94,)|
Show InChI InChI=1S/C33H36N6O2S/c1-39-27-8-4-3-6-21(27)16-28(39)33(40)38-26-14-9-20(17-29(26)41-2)25-19-42-31-22(18-37-32(35)30(25)31)7-5-15-36-24-12-10-23(34)11-13-24/h3-9,14,16-19,23-24,36H,10-13,15,34H2,1-2H3,(H2,35,37)(H,38,40)/b7-5+/t23-,24-
n/an/a 1.97E+4n/an/an/an/an/an/a
Abbott Bioresearch Center
Curated by ChEMBL
Assay Description
Inhibition of Src
Bioorg Med Chem Lett 17: 1167-71 (2007)
Article DOI: 10.1016/j.bmcl.2006.12.035
BindingDB Entry DOI: 10.7270/Q24Q7TN6
Tyrosine-protein kinase Fgr
(Homo sapiens (Human))
BDBM50202737
(CHEMBL395665 | N-(4-(4-amino-7-(3-((1r,4r)-4-amino...)
Show SMILES COc1cc(ccc1NC(=O)c1cc2ccccc2n1C)-c1csc2c(\C=C\CN[C@H]3CC[C@H](N)CC3)cnc(N)c12 |wU:30.32,wD:33.36,(5.61,-23.77,;4.15,-23.29,;3.01,-24.32,;1.54,-23.84,;.4,-24.87,;.73,-26.38,;2.18,-26.85,;3.33,-25.82,;4.78,-26.3,;5.1,-27.8,;3.96,-28.84,;6.57,-28.28,;7.04,-29.76,;8.59,-29.75,;9.62,-30.9,;11.13,-30.57,;11.61,-29.11,;10.57,-27.96,;9.07,-28.28,;7.83,-27.37,;7.83,-25.83,;-1.07,-24.39,;-2.31,-25.31,;-3.56,-24.4,;-3.08,-22.94,;-3.85,-21.62,;-5.39,-21.62,;-6.16,-20.29,;-7.7,-20.3,;-8.47,-18.96,;-7.71,-17.63,;-8.47,-16.3,;-7.7,-14.97,;-6.16,-14.97,;-5.39,-13.64,;-5.4,-16.3,;-6.16,-17.63,;-3.09,-20.3,;-1.55,-20.29,;-.79,-21.62,;.75,-21.62,;-1.55,-22.94,)|
Show InChI InChI=1S/C33H36N6O2S/c1-39-27-8-4-3-6-21(27)16-28(39)33(40)38-26-14-9-20(17-29(26)41-2)25-19-42-31-22(18-37-32(35)30(25)31)7-5-15-36-24-12-10-23(34)11-13-24/h3-9,14,16-19,23-24,36H,10-13,15,34H2,1-2H3,(H2,35,37)(H,38,40)/b7-5+/t23-,24-
n/an/a 1.79E+4n/an/an/an/an/an/a
Abbott Bioresearch Center
Curated by ChEMBL
Assay Description
Inhibition of Fgr
Bioorg Med Chem Lett 17: 1167-71 (2007)
Article DOI: 10.1016/j.bmcl.2006.12.035
BindingDB Entry DOI: 10.7270/Q24Q7TN6
Tyrosine-protein kinase Lyn
(Homo sapiens (Human))
BDBM50202737
(CHEMBL395665 | N-(4-(4-amino-7-(3-((1r,4r)-4-amino...)
Show SMILES COc1cc(ccc1NC(=O)c1cc2ccccc2n1C)-c1csc2c(\C=C\CN[C@H]3CC[C@H](N)CC3)cnc(N)c12 |wU:30.32,wD:33.36,(5.61,-23.77,;4.15,-23.29,;3.01,-24.32,;1.54,-23.84,;.4,-24.87,;.73,-26.38,;2.18,-26.85,;3.33,-25.82,;4.78,-26.3,;5.1,-27.8,;3.96,-28.84,;6.57,-28.28,;7.04,-29.76,;8.59,-29.75,;9.62,-30.9,;11.13,-30.57,;11.61,-29.11,;10.57,-27.96,;9.07,-28.28,;7.83,-27.37,;7.83,-25.83,;-1.07,-24.39,;-2.31,-25.31,;-3.56,-24.4,;-3.08,-22.94,;-3.85,-21.62,;-5.39,-21.62,;-6.16,-20.29,;-7.7,-20.3,;-8.47,-18.96,;-7.71,-17.63,;-8.47,-16.3,;-7.7,-14.97,;-6.16,-14.97,;-5.39,-13.64,;-5.4,-16.3,;-6.16,-17.63,;-3.09,-20.3,;-1.55,-20.29,;-.79,-21.62,;.75,-21.62,;-1.55,-22.94,)|
Show InChI InChI=1S/C33H36N6O2S/c1-39-27-8-4-3-6-21(27)16-28(39)33(40)38-26-14-9-20(17-29(26)41-2)25-19-42-31-22(18-37-32(35)30(25)31)7-5-15-36-24-12-10-23(34)11-13-24/h3-9,14,16-19,23-24,36H,10-13,15,34H2,1-2H3,(H2,35,37)(H,38,40)/b7-5+/t23-,24-
Reactome pathway
n/an/a 1.85E+4n/an/an/an/an/an/a
Abbott Bioresearch Center
Curated by ChEMBL
Assay Description
Inhibition of Lyn
Bioorg Med Chem Lett 17: 1167-71 (2007)
Article DOI: 10.1016/j.bmcl.2006.12.035
BindingDB Entry DOI: 10.7270/Q24Q7TN6
Tyrosine-protein kinase Fyn
(Homo sapiens (Human))
BDBM50202737
(CHEMBL395665 | N-(4-(4-amino-7-(3-((1r,4r)-4-amino...)
Show SMILES COc1cc(ccc1NC(=O)c1cc2ccccc2n1C)-c1csc2c(\C=C\CN[C@H]3CC[C@H](N)CC3)cnc(N)c12 |wU:30.32,wD:33.36,(5.61,-23.77,;4.15,-23.29,;3.01,-24.32,;1.54,-23.84,;.4,-24.87,;.73,-26.38,;2.18,-26.85,;3.33,-25.82,;4.78,-26.3,;5.1,-27.8,;3.96,-28.84,;6.57,-28.28,;7.04,-29.76,;8.59,-29.75,;9.62,-30.9,;11.13,-30.57,;11.61,-29.11,;10.57,-27.96,;9.07,-28.28,;7.83,-27.37,;7.83,-25.83,;-1.07,-24.39,;-2.31,-25.31,;-3.56,-24.4,;-3.08,-22.94,;-3.85,-21.62,;-5.39,-21.62,;-6.16,-20.29,;-7.7,-20.3,;-8.47,-18.96,;-7.71,-17.63,;-8.47,-16.3,;-7.7,-14.97,;-6.16,-14.97,;-5.39,-13.64,;-5.4,-16.3,;-6.16,-17.63,;-3.09,-20.3,;-1.55,-20.29,;-.79,-21.62,;.75,-21.62,;-1.55,-22.94,)|
Show InChI InChI=1S/C33H36N6O2S/c1-39-27-8-4-3-6-21(27)16-28(39)33(40)38-26-14-9-20(17-29(26)41-2)25-19-42-31-22(18-37-32(35)30(25)31)7-5-15-36-24-12-10-23(34)11-13-24/h3-9,14,16-19,23-24,36H,10-13,15,34H2,1-2H3,(H2,35,37)(H,38,40)/b7-5+/t23-,24-
n/an/a 2.59E+4n/an/an/an/an/an/a
Abbott Bioresearch Center
Curated by ChEMBL
Assay Description
Inhibition of Fyn
Bioorg Med Chem Lett 17: 1167-71 (2007)
Article DOI: 10.1016/j.bmcl.2006.12.035
BindingDB Entry DOI: 10.7270/Q24Q7TN6
Vascular endothelial growth factor receptor 2
(Homo sapiens (Human))
BDBM50202737
(CHEMBL395665 | N-(4-(4-amino-7-(3-((1r,4r)-4-amino...)
Show SMILES COc1cc(ccc1NC(=O)c1cc2ccccc2n1C)-c1csc2c(\C=C\CN[C@H]3CC[C@H](N)CC3)cnc(N)c12 |wU:30.32,wD:33.36,(5.61,-23.77,;4.15,-23.29,;3.01,-24.32,;1.54,-23.84,;.4,-24.87,;.73,-26.38,;2.18,-26.85,;3.33,-25.82,;4.78,-26.3,;5.1,-27.8,;3.96,-28.84,;6.57,-28.28,;7.04,-29.76,;8.59,-29.75,;9.62,-30.9,;11.13,-30.57,;11.61,-29.11,;10.57,-27.96,;9.07,-28.28,;7.83,-27.37,;7.83,-25.83,;-1.07,-24.39,;-2.31,-25.31,;-3.56,-24.4,;-3.08,-22.94,;-3.85,-21.62,;-5.39,-21.62,;-6.16,-20.29,;-7.7,-20.3,;-8.47,-18.96,;-7.71,-17.63,;-8.47,-16.3,;-7.7,-14.97,;-6.16,-14.97,;-5.39,-13.64,;-5.4,-16.3,;-6.16,-17.63,;-3.09,-20.3,;-1.55,-20.29,;-.79,-21.62,;.75,-21.62,;-1.55,-22.94,)|
Show InChI InChI=1S/C33H36N6O2S/c1-39-27-8-4-3-6-21(27)16-28(39)33(40)38-26-14-9-20(17-29(26)41-2)25-19-42-31-22(18-37-32(35)30(25)31)7-5-15-36-24-12-10-23(34)11-13-24/h3-9,14,16-19,23-24,36H,10-13,15,34H2,1-2H3,(H2,35,37)(H,38,40)/b7-5+/t23-,24-
NCI pathway
Reactome pathway
n/an/a 1.85E+4n/an/an/an/an/an/a
Abbott Bioresearch Center
Curated by ChEMBL
Assay Description
Inhibition of KDR
Bioorg Med Chem Lett 17: 1167-71 (2007)
Article DOI: 10.1016/j.bmcl.2006.12.035
BindingDB Entry DOI: 10.7270/Q24Q7TN6
Tyrosine-protein kinase Lck
(Homo sapiens (Human))
BDBM50202737
(CHEMBL395665 | N-(4-(4-amino-7-(3-((1r,4r)-4-amino...)
Show SMILES COc1cc(ccc1NC(=O)c1cc2ccccc2n1C)-c1csc2c(\C=C\CN[C@H]3CC[C@H](N)CC3)cnc(N)c12 |wU:30.32,wD:33.36,(5.61,-23.77,;4.15,-23.29,;3.01,-24.32,;1.54,-23.84,;.4,-24.87,;.73,-26.38,;2.18,-26.85,;3.33,-25.82,;4.78,-26.3,;5.1,-27.8,;3.96,-28.84,;6.57,-28.28,;7.04,-29.76,;8.59,-29.75,;9.62,-30.9,;11.13,-30.57,;11.61,-29.11,;10.57,-27.96,;9.07,-28.28,;7.83,-27.37,;7.83,-25.83,;-1.07,-24.39,;-2.31,-25.31,;-3.56,-24.4,;-3.08,-22.94,;-3.85,-21.62,;-5.39,-21.62,;-6.16,-20.29,;-7.7,-20.3,;-8.47,-18.96,;-7.71,-17.63,;-8.47,-16.3,;-7.7,-14.97,;-6.16,-14.97,;-5.39,-13.64,;-5.4,-16.3,;-6.16,-17.63,;-3.09,-20.3,;-1.55,-20.29,;-.79,-21.62,;.75,-21.62,;-1.55,-22.94,)|
Show InChI InChI=1S/C33H36N6O2S/c1-39-27-8-4-3-6-21(27)16-28(39)33(40)38-26-14-9-20(17-29(26)41-2)25-19-42-31-22(18-37-32(35)30(25)31)7-5-15-36-24-12-10-23(34)11-13-24/h3-9,14,16-19,23-24,36H,10-13,15,34H2,1-2H3,(H2,35,37)(H,38,40)/b7-5+/t23-,24-
n/an/a 110n/an/an/an/an/an/a
Abbott Bioresearch Center
Curated by ChEMBL
Assay Description
Inhibition of Lck
Bioorg Med Chem Lett 17: 1167-71 (2007)
Article DOI: 10.1016/j.bmcl.2006.12.035
BindingDB Entry DOI: 10.7270/Q24Q7TN6
Tyrosine-protein kinase HCK
(Homo sapiens (Human))
BDBM50202737
(CHEMBL395665 | N-(4-(4-amino-7-(3-((1r,4r)-4-amino...)
Show SMILES COc1cc(ccc1NC(=O)c1cc2ccccc2n1C)-c1csc2c(\C=C\CN[C@H]3CC[C@H](N)CC3)cnc(N)c12 |wU:30.32,wD:33.36,(5.61,-23.77,;4.15,-23.29,;3.01,-24.32,;1.54,-23.84,;.4,-24.87,;.73,-26.38,;2.18,-26.85,;3.33,-25.82,;4.78,-26.3,;5.1,-27.8,;3.96,-28.84,;6.57,-28.28,;7.04,-29.76,;8.59,-29.75,;9.62,-30.9,;11.13,-30.57,;11.61,-29.11,;10.57,-27.96,;9.07,-28.28,;7.83,-27.37,;7.83,-25.83,;-1.07,-24.39,;-2.31,-25.31,;-3.56,-24.4,;-3.08,-22.94,;-3.85,-21.62,;-5.39,-21.62,;-6.16,-20.29,;-7.7,-20.3,;-8.47,-18.96,;-7.71,-17.63,;-8.47,-16.3,;-7.7,-14.97,;-6.16,-14.97,;-5.39,-13.64,;-5.4,-16.3,;-6.16,-17.63,;-3.09,-20.3,;-1.55,-20.29,;-.79,-21.62,;.75,-21.62,;-1.55,-22.94,)|
Show InChI InChI=1S/C33H36N6O2S/c1-39-27-8-4-3-6-21(27)16-28(39)33(40)38-26-14-9-20(17-29(26)41-2)25-19-42-31-22(18-37-32(35)30(25)31)7-5-15-36-24-12-10-23(34)11-13-24/h3-9,14,16-19,23-24,36H,10-13,15,34H2,1-2H3,(H2,35,37)(H,38,40)/b7-5+/t23-,24-
Reactome pathway
n/an/a 2.41E+4n/an/an/an/an/an/a
Abbott Bioresearch Center
Curated by ChEMBL
Assay Description
Inhibition of Hck
Bioorg Med Chem Lett 17: 1167-71 (2007)
Article DOI: 10.1016/j.bmcl.2006.12.035
BindingDB Entry DOI: 10.7270/Q24Q7TN6
Angiopoietin-1 receptor
(Homo sapiens (Human))
BDBM50202737
(CHEMBL395665 | N-(4-(4-amino-7-(3-((1r,4r)-4-amino...)
Show SMILES COc1cc(ccc1NC(=O)c1cc2ccccc2n1C)-c1csc2c(\C=C\CN[C@H]3CC[C@H](N)CC3)cnc(N)c12 |wU:30.32,wD:33.36,(5.61,-23.77,;4.15,-23.29,;3.01,-24.32,;1.54,-23.84,;.4,-24.87,;.73,-26.38,;2.18,-26.85,;3.33,-25.82,;4.78,-26.3,;5.1,-27.8,;3.96,-28.84,;6.57,-28.28,;7.04,-29.76,;8.59,-29.75,;9.62,-30.9,;11.13,-30.57,;11.61,-29.11,;10.57,-27.96,;9.07,-28.28,;7.83,-27.37,;7.83,-25.83,;-1.07,-24.39,;-2.31,-25.31,;-3.56,-24.4,;-3.08,-22.94,;-3.85,-21.62,;-5.39,-21.62,;-6.16,-20.29,;-7.7,-20.3,;-8.47,-18.96,;-7.71,-17.63,;-8.47,-16.3,;-7.7,-14.97,;-6.16,-14.97,;-5.39,-13.64,;-5.4,-16.3,;-6.16,-17.63,;-3.09,-20.3,;-1.55,-20.29,;-.79,-21.62,;.75,-21.62,;-1.55,-22.94,)|
Show InChI InChI=1S/C33H36N6O2S/c1-39-27-8-4-3-6-21(27)16-28(39)33(40)38-26-14-9-20(17-29(26)41-2)25-19-42-31-22(18-37-32(35)30(25)31)7-5-15-36-24-12-10-23(34)11-13-24/h3-9,14,16-19,23-24,36H,10-13,15,34H2,1-2H3,(H2,35,37)(H,38,40)/b7-5+/t23-,24-
n/an/a 1.90E+3n/an/an/an/an/an/a
Abbott Bioresearch Center
Curated by ChEMBL
Assay Description
Inhibition of Tie2
Bioorg Med Chem Lett 17: 1167-71 (2007)
Article DOI: 10.1016/j.bmcl.2006.12.035
BindingDB Entry DOI: 10.7270/Q24Q7TN6