BDBM50203016 6-chloro-3-(3,4-dioxo-2-(phenylamino)cyclobut-1-enylamino)-2-hydroxy-N-(2-methoxyethyl)benzenesulfonamide::CHEMBL391465
SMILES: COCCNS(=O)(=O)c1c(Cl)ccc(Nc2c(Nc3ccccc3)c(=O)c2=O)c1O
InChI Key: InChIKey=YFRWUYGCNCHTLG-UHFFFAOYSA-N
Data: 1 IC50
Activity Spreadsheet -- Enzyme Inhibition Constant Data from BindingDB
Found 1 hit for monomerid = 50203016
Trg + Lig
Ki
nM
ΔG°
kcal/mole
IC50
nM
Kd
nM
EC50/IC50
nM
koff
s-1
kon
M-1s-1
pHTemp
°C
C-X-C chemokine receptor type 2
(Homo sapiens (Human))
BDBM50203016
(6-chloro-3-(3,4-dioxo-2-(phenylamino)cyclobut-1-en...)
Show SMILES COCCNS(=O)(=O)c1c(Cl)ccc(Nc2c(Nc3ccccc3)c(=O)c2=O)c1O
Show InChI InChI=1S/C19H18ClN3O6S/c1-29-10-9-21-30(27,28)19-12(20)7-8-13(16(19)24)23-15-14(17(25)18(15)26)22-11-5-3-2-4-6-11/h2-8,21-24H,9-10H2,1H3
Reactome pathway
n/an/a 8n/an/an/an/an/an/a
GlaxoSmithKline
Curated by ChEMBL
Assay Description
Displacement of [125I]IL8 from human recombinant CXCR2 expressed in CHO cells
Bioorg Med Chem Lett 17: 1713-7 (2007)
Article DOI: 10.1016/j.bmcl.2006.12.067
BindingDB Entry DOI: 10.7270/Q2Z320GC