BDBM50203122 5,8,13,13a-tetrahydro-9,10-dimethoxy-6H-benzo(g)-1,3-benzodioxolo(5,6-a)quinolizine::5,8,13,13a-tetrahydro-9,10-dimethoxy-6H-benzo(g)benzo-1,3-dioxolo(5,6-a)quinolizine::9,10-dimethoxy-2,3-(methylenedioxy)berbine::9,10-dimethoxy-5,8,13,13a-tetrahydro-6H-[1,3]dioxolo[4,5-g]isoquino[3,2-a]isoquinoline::CHEMBL275097::Canadin::canadine::tetrahydroberberine::xanthopuccine
SMILES: COc1ccc2CC3N(CCc4cc5OCOc5cc34)Cc2c1OC
InChI Key: InChIKey=VZTUIEROBZXUFA-UHFFFAOYSA-N
Data: 1 KI  3 IC50
Activity Spreadsheet -- Enzyme Inhibition Constant Data from BindingDB
Found 4 hits for monomerid = 50203122
Trg + Lig
Ki
nM
ΔG°
kcal/mole
IC50
nM
Kd
nM
EC50/IC50
nM
koff
s-1
kon
M-1s-1
pHTemp
°C
Alpha-1A adrenergic receptor
(Rattus norvegicus (Rat))
BDBM50203122
(5,8,13,13a-tetrahydro-9,10-dimethoxy-6H-benzo(g)-1...)
Show SMILES COc1ccc2CC3N(CCc4cc5OCOc5cc34)Cc2c1OC
Show InChI InChI=1S/C20H21NO4/c1-22-17-4-3-12-7-16-14-9-19-18(24-11-25-19)8-13(14)5-6-21(16)10-15(12)20(17)23-2/h3-4,8-9,16H,5-7,10-11H2,1-2H3
1.12E+3n/an/an/an/an/an/an/an/a
Chinese Academy of Sciences
Curated by ChEMBL
Assay Description
Displacement of [125I]-BE2254 from Wistar rat alpha1A adrenoceptor after 20 mins
J Med Chem 59: 9489-9502 (2016)
Article DOI: 10.1021/acs.jmedchem.6b01217
BindingDB Entry DOI: 10.7270/Q2TB18VD
Cyclin-dependent kinase 2
(Homo sapiens (Human))
BDBM50203122
(5,8,13,13a-tetrahydro-9,10-dimethoxy-6H-benzo(g)-1...)
Show SMILES COc1ccc2CC3N(CCc4cc5OCOc5cc34)Cc2c1OC
Show InChI InChI=1S/C20H21NO4/c1-22-17-4-3-12-7-16-14-9-19-18(24-11-25-19)8-13(14)5-6-21(16)10-15(12)20(17)23-2/h3-4,8-9,16H,5-7,10-11H2,1-2H3
NCI pathway
Reactome pathway
n/an/a>5.00E+4n/an/an/an/an/an/a
Schering Plough Research Institute
Curated by ChEMBL
Assay Description
Inhibition of CDK2
Bioorg Med Chem Lett 20: 1384-7 (2010)
Article DOI: 10.1016/j.bmcl.2010.01.007
BindingDB Entry DOI: 10.7270/Q2QF8TTB
Reverse transcriptase
(Human immunodeficiency virus 1)
BDBM50203122
(5,8,13,13a-tetrahydro-9,10-dimethoxy-6H-benzo(g)-1...)
Show SMILES COc1ccc2CC3N(CCc4cc5OCOc5cc34)Cc2c1OC
Show InChI InChI=1S/C20H21NO4/c1-22-17-4-3-12-7-16-14-9-19-18(24-11-25-19)8-13(14)5-6-21(16)10-15(12)20(17)23-2/h3-4,8-9,16H,5-7,10-11H2,1-2H3
n/an/a>5.89E+5n/an/an/an/an/an/a
University of Illinois
Curated by ChEMBL
Assay Description
Inhibition of HIV1 RT
J Nat Prod 54: 143-54
Article DOI: 10.1021/np50073a012
BindingDB Entry DOI: 10.7270/Q2NK3HTG
Coagulation factor VII/tissue factor
(Homo sapiens (Human))
BDBM50203122
(5,8,13,13a-tetrahydro-9,10-dimethoxy-6H-benzo(g)-1...)
Show SMILES COc1ccc2CC3N(CCc4cc5OCOc5cc34)Cc2c1OC
Show InChI InChI=1S/C20H21NO4/c1-22-17-4-3-12-7-16-14-9-19-18(24-11-25-19)8-13(14)5-6-21(16)10-15(12)20(17)23-2/h3-4,8-9,16H,5-7,10-11H2,1-2H3
Reactome pathway
n/an/a 8.40n/an/an/an/an/an/a
China Pharmaceutical University
Curated by ChEMBL
Assay Description
Inhibition of tissue factor procoagulant activity in LPS-stimulated human THP1 cells preincubated for 1 hr before LPS addition measured after 5 hrs
Bioorg Med Chem 21: 62-9 (2012)
Article DOI: 10.1016/j.bmc.2012.11.002
BindingDB Entry DOI: 10.7270/Q2M32X22