BDBM50203147 CHEMBL3893222
SMILES: [H][C@]1(OCCCc2nc(NC(=O)N[C@@H]1c1ccccc1)cc1cnn(CC)c21)[C@@H](C)O
InChI Key: InChIKey=ZOCDMCKSAQKHPE-MMACOIQUSA-N
Data: 1 IC50
Activity Spreadsheet -- Enzyme Inhibition Constant Data from BindingDB
Found 1 hit for monomerid = 50203147
Trg + Lig
Ki
nM
ΔG°
kcal/mole
IC50
nM
Kd
nM
EC50/IC50
nM
koff
s-1
kon
M-1s-1
pHTemp
°C
Mitogen-activated protein kinase 1
(Homo sapiens (Human))
BDBM50203147
(CHEMBL3893222)
Show SMILES [H][C@]1(OCCCc2nc(NC(=O)N[C@@H]1c1ccccc1)cc1cnn(CC)c21)[C@@H](C)O |r|
Show InChI InChI=1S/C22H27N5O3/c1-3-27-20-16(13-23-27)12-18-24-17(20)10-7-11-30-21(14(2)28)19(26-22(29)25-18)15-8-5-4-6-9-15/h4-6,8-9,12-14,19,21,28H,3,7,10-11H2,1-2H3,(H2,24,25,26,29)/t14-,19-,21+/m1/s1
NCI pathway
Reactome pathway
n/an/a 687n/an/an/an/an/an/a
Dart Neuroscience LLC
Curated by ChEMBL
Assay Description
Inhibition of human activated ERK2 assessed as reduction in phosphorylation activity preincubated for 15 mins followed by addition of IMAP peptide as...
ACS Med Chem Lett 7: 1020-1021 (2016)
Article DOI: 10.1021/acsmedchemlett.6b00434
BindingDB Entry DOI: 10.7270/Q26Q207M