BDBM50203301 CHEMBL435316::benzyl 4-[(2-pyrimidinylamino)methyl]-1-piperidinecarboxylate
SMILES: O=C(OCc1ccccc1)N1CCC(CNc2ncccn2)CC1
InChI Key: InChIKey=RBKBGIONDAWNLO-UHFFFAOYSA-N
Data: 1 KI  3 IC50
Activity Spreadsheet -- Enzyme Inhibition Constant Data from BindingDB
Found 4 hits for monomerid = 50203301
Trg + Lig
Ki
nM
ΔG°
kcal/mole
IC50
nM
Kd
nM
EC50/IC50
nM
koff
s-1
kon
M-1s-1
pHTemp
°C
Glutamate receptor ionotropic, NMDA 2B
(Homo sapiens (Human))
BDBM50203301
(CHEMBL435316 | benzyl 4-[(2-pyrimidinylamino)methy...)
Show SMILES O=C(OCc1ccccc1)N1CCC(CNc2ncccn2)CC1
Show InChI InChI=1S/C18H22N4O2/c23-18(24-14-16-5-2-1-3-6-16)22-11-7-15(8-12-22)13-21-17-19-9-4-10-20-17/h1-6,9-10,15H,7-8,11-14H2,(H,19,20,21)
NCI pathway
Reactome pathway
23n/an/an/an/an/an/an/an/a
Merck Research Laboratories
Curated by ChEMBL
Assay Description
Displacement of [3H](E)-N1-(2-methoxybenzyl)cinnamamidine from human NR2B expressed in Ltk- cells
J Med Chem 50: 807-19 (2007)
Article DOI: 10.1021/jm060983w
BindingDB Entry DOI: 10.7270/Q2FX7944
Cytochrome P450 3A4
(Homo sapiens (Human))
BDBM50203301
(CHEMBL435316 | benzyl 4-[(2-pyrimidinylamino)methy...)
Show SMILES O=C(OCc1ccccc1)N1CCC(CNc2ncccn2)CC1
Show InChI InChI=1S/C18H22N4O2/c23-18(24-14-16-5-2-1-3-6-16)22-11-7-15(8-12-22)13-21-17-19-9-4-10-20-17/h1-6,9-10,15H,7-8,11-14H2,(H,19,20,21)
Reactome pathway
n/an/a>2.50E+4n/an/an/an/an/an/a
Merck Research Laboratories
Curated by ChEMBL
Assay Description
Inhibition of CYP3A4 in human liver microsomes
J Med Chem 50: 807-19 (2007)
Article DOI: 10.1021/jm060983w
BindingDB Entry DOI: 10.7270/Q2FX7944
Cytochrome P450 2C9
(Homo sapiens (Human))
BDBM50203301
(CHEMBL435316 | benzyl 4-[(2-pyrimidinylamino)methy...)
Show SMILES O=C(OCc1ccccc1)N1CCC(CNc2ncccn2)CC1
Show InChI InChI=1S/C18H22N4O2/c23-18(24-14-16-5-2-1-3-6-16)22-11-7-15(8-12-22)13-21-17-19-9-4-10-20-17/h1-6,9-10,15H,7-8,11-14H2,(H,19,20,21)
Reactome pathway
n/an/a>2.50E+4n/an/an/an/an/an/a
Merck Research Laboratories
Curated by ChEMBL
Assay Description
Inhibition of CYP2C9 in human liver microsomes
J Med Chem 50: 807-19 (2007)
Article DOI: 10.1021/jm060983w
BindingDB Entry DOI: 10.7270/Q2FX7944
Cytochrome P450 2D6
(Homo sapiens (Human))
BDBM50203301
(CHEMBL435316 | benzyl 4-[(2-pyrimidinylamino)methy...)
Show SMILES O=C(OCc1ccccc1)N1CCC(CNc2ncccn2)CC1
Show InChI InChI=1S/C18H22N4O2/c23-18(24-14-16-5-2-1-3-6-16)22-11-7-15(8-12-22)13-21-17-19-9-4-10-20-17/h1-6,9-10,15H,7-8,11-14H2,(H,19,20,21)
n/an/a>2.50E+4n/an/an/an/an/an/a
Merck Research Laboratories
Curated by ChEMBL
Assay Description
Inhibition of CYP2D6 in human liver microsomes
J Med Chem 50: 807-19 (2007)
Article DOI: 10.1021/jm060983w
BindingDB Entry DOI: 10.7270/Q2FX7944